Package Details: google-drive-ocamlfuse 0.7.17-1

Git Clone URL: https://aur.archlinux.org/google-drive-ocamlfuse.git (read-only, click to copy)
Package Base: google-drive-ocamlfuse
Description: FUSE-based file system backed by Google Drive, written in OCaml
Upstream URL: https://astrada.github.io/google-drive-ocamlfuse/
Keywords: drive fuse google ocaml
Licenses: MIT
Submitter: mlq
Maintainer: pricechrispy
Last Packager: pricechrispy
Votes: 57
Popularity: 1.46
First Submitted: 2013-10-14 21:44
Last Updated: 2020-01-21 01:40

Dependencies (7)

Required by (1)

Sources (1)

Pinned Comments

pricechrispy commented on 2018-01-27 00:47

Another error now exists with the camlidl package on a fresh build system.

In this case, the package is no longer creating a required file called "META". This prevents camlidl from showing up as installed, and prevents the package from building.

If you run "ocamlfind list | grep -i 'camlidl'", you should see the camlidl packages listed.

If not, manually create the META file: /usr/lib/ocaml/camlidl/META

description = "Stub generator"
version = "1.06"
directory = "^"
archive(byte) = "com.cma"
archive(native) = "com.cmxa"

pricechrispy commented on 2017-04-25 17:39

Before you flag this package out-of-date:

According to the official project page: https://astrada.github.io/google-drive-ocamlfuse/
Find latest release versions here: https://launchpad.net/~alessandro-strada/+archive/ubuntu/ppa

The latest releases are not all tagged versions on GitHub.
For the latest development versions on git, try: https://aur.archlinux.org/packages/google-drive-ocamlfuse-git

OLD official project page: http://gdfuse.forge.ocamlcore.org/
OLD release versions here: https://forge.ocamlcore.org/frs/?group_id=305

pricechrispy commented on 2016-11-17 10:46

While upgrading to the newer build, the same build error persists as reported in the comments.

When doing a fresh build, I manually created symlinks as root so that the build process finds them, as similarly suggested in the comments.

# ln -s /usr/lib/ocaml/com.cmxa /usr/lib/ocaml/camlidl/
# ln -s /usr/lib/ocaml/com.a /usr/lib/ocaml/camlidl/

After doing this, the directory '/usr/lib/ocaml/camlidl/' should have the following structure in a fresh environment:

$ ls -l /usr/lib/ocaml/camlidl/
total 4
lrwxrwxrwx 1 root root 20 Nov 17 02:23 com.a -> /usr/lib/ocaml/com.a
lrwxrwxrwx 1 root root 23 Nov 17 02:23 com.cmxa -> /usr/lib/ocaml/com.cmxa
-rw-r--r-- 1 root root 102 Nov 17 01:11 META

As suggested in the comments, this seems to be an issue with the camlidl package.

This should allow the package to build for now, until an automated PKGBUILD solution is found.

Latest Comments

« First ‹ Previous ... 8 9 10 11 12 13 14 15 16 Next › Last »

jkl commented on 2014-07-26 16:28

I've updated the ocamlfuse package. Works for me, but I would appreciate feedback.

neonkowy commented on 2014-07-24 08:30

apprently it needs ocaml-curl and ocaml-extlib
[code]
Finished, 1 target (0 cached) in 00:00:02.
+ /usr/bin/ocamlfind ocamlopt -g -linkpkg -package Fuse -package camlidl -package gapi-ocaml -package sqlite3 -package threads -thread src/appDir.cmx src/utils.cmx src/config.cmx src/cache.cmx src/concurrentGlobal.cmx src/keyValueStore.cmx src/state.cmx src/context.cmx src/gaeProxy.cmx src/mime.cmx src/oauth2.cmx src/drive.cmx src/gdfuse.cmx -o src/gdfuse.native
gcc: error: /usr/lib/ocaml/curl/curl.a: Nie ma takiego pliku ani katalogu
gcc: error: /usr/lib/ocaml/extlib/extLib.a: Nie ma takiego pliku ani katalogu
File "caml_startup", line 1:
Error: Error during linking
Command exited with code 2.
Compilation unsuccessful after building 40 targets (0 cached) in 00:00:04.
E: Failure("Command ''/usr/bin/ocamlbuild' src/gdfuse.native -tag debug' terminated with error code 10")
==> BŁĄD: Wystąpił błąd w build().
Przerywam...
The build failed.
[/code]

lesebas commented on 2014-07-09 19:34

Hello,

I've request the maintener of ocamlfuse and ocaml-sqlite3 to add the option staticlibs in their PKGBUILD.

I have overpass the problem of segmentation fault by adding the -d option in the command (I don't understand why but it works fine now):

google-drive-ocamlfuse -d <google-drive-folder>

lesebas commented on 2014-07-08 16:59

@all

same problem of .a library issing solved like that :

edit /etc/makepkg.conf
modify the option from !staticlibs to staticlibs
rebuild ALL the package ocaml (for example if sqlite3.a is missing => yaourt -S ocaml-sqlite3).

By the way I still experiencing segmentation fault on my 64bits system.

lenovomi commented on 2014-07-07 20:03

does it work on arm7?

lenovomi commented on 2014-07-07 20:03

doest i work on arm7?

ptchinster commented on 2014-06-07 20:23

Same problem as draugole

ptchinster@hostname ~ $ yaourt -S google-drive-ocamlfuse --noconfirm
...
gcc: error: /usr/lib/ocaml/sqlite3/sqlite3.a: No such file or directory
gcc: error: /usr/lib/ocaml/curl/curl.a: No such file or directory
gcc: error: /usr/lib/ocaml/extlib/extLib.a: No such file or directory
gcc: error: /usr/lib/ocaml/site-lib/Fuse/Fuse.a: No such file or directory
File "caml_startup", line 1:
Error: Error during linking
Command exited with code 2.
Compilation unsuccessful after building 40 targets (0 cached) in 00:00:06.
E: Failure("Command ''/usr/bin/ocamlbuild' src/gdfuse.native -tag debug' terminated with error code 10")
==> ERROR: A failure occurred in build().
Aborting...
==> ERROR: Makepkg was unable to build .
==> Restart building google-drive-ocamlfuse ? [y/N]
==> -----------------------------------------------
==>

draugole commented on 2014-05-28 07:22

I've been following the comments and after performing the steps Siguo with the error
"E: Failure (" Command'' / usr / bin / ocamlbuild 'src / gdfuse.native-tag debug' terminated with error code 10 ")"

I'm just trying to perform the installation by OPAM

nfishr commented on 2014-05-16 23:43

@jan_path That did it for me. Thanks a lot!

willemw commented on 2014-05-08 15:18

Maybe the relevant package maintainers should update their PKGBUILD files instead, as suggested here: https://www.archlinux.org/todo/remove-static-libraries/