Package Details: goldendict-git 1.5.0.RC.1017.g09a7d4db-1

Git Clone URL: https://aur.archlinux.org/goldendict-git.git (read-only, click to copy)
Package Base: goldendict-git
Description: A feature-rich dictionary lookup program, supporting multiple dictionary formats.
Upstream URL: http://goldendict.org/
Licenses: GPL3
Conflicts: goldendict, goldendict-git-opt, goldendict-svn
Provides: goldendict
Replaces: goldendict, goldendict-git-opt, goldendict-svn
Submitter: Infy
Maintainer: aksr
Last Packager: aksr
Votes: 63
Popularity: 0.43
First Submitted: 2009-11-13 13:32
Last Updated: 2019-06-01 12:25

Latest Comments

« First ‹ Previous 1 2 3 4 5 6 7 Next › Last »

oracleyue commented on 2014-09-25 15:57

I met the same problem as "stas2" did. I rebuilt it, it works, but worked at 100% CPU.

oracleyue commented on 2014-09-25 15:22

This version is always working at 100% CPU.

stas commented on 2014-09-25 11:56

Had the missing libavutil.so.52 error too. Probably because of updated ffmpeg package, which now ships libavutil.so.54. Rebuilding goldendict solved the problem.

proft commented on 2014-09-25 11:29

Today goldendict told this:

goldendict: error while loading shared libraries: libavutil.so.52: cannot open shared object file: No such file or directory

proft commented on 2014-07-23 08:21

Last version dont build :(. Error:

QFSFileEngine::currentPath: getcwd() failed
QFSFileEngine::currentPath: getcwd() failed
QFSFileEngine::currentPath: getcwd() failed
moc: mouseover.hh: No such file
Makefile:821: recipe for target 'build/moc_mouseover.cpp' failed
make: *** [build/moc_mouseover.cpp] Error 1
==> ERROR: A failure occurred in build().
Aborting...

wisecrick commented on 2014-06-06 16:53

libeb is also required

caseyjp1 commented on 2014-05-09 00:58

erroring out with this:
usr/lib/gcc/x86_64-unknown-linux-gnu/4.9.0/include/stdint.h:15:1: error: missing terminating " character
postal_fmt "<U0025><U0066><U0025><U004E><U0025><U0061><U0025><U004E>/
^
/usr/lib/gcc/x86_64-unknown-linux-gnu/4.9.0/include/stdint.h:1:1: error: ‘by_space’ does not name a type
by_space 1
^
config.cc:64:1: error: ‘uint32_t’ does not name a type
uint32_t const keyMask = 0x01FFFFFF;
^
config.cc: In constructor ‘Config::HotKey::HotKey(const QKeySequence&)’:
config.cc:67:26: error: ‘keyMask’ was not declared in this scope
modifiers( seq[ 0 ] & ~keyMask ),
^
config.cc: In function ‘void Config::save(const Config::Class&)’:
config.cc:1873:64: error: ‘renameAtomically’ was not declared in this scope
renameAtomically( configFile.fileName(), getConfigFileName() );
^
Makefile:1611: recipe for target 'build/config.o' failed
make: *** [build/config.o] Error 1
==> ERROR: A failure occurred in build().
Aborting...
==> ERROR: Makepkg was unable to build goldendict-git.

VirtualTam commented on 2014-02-20 20:16

@proft: the issue has been fixed upstream, see https://github.com/goldendict/goldendict/commit/ffabaf1861ef2bf1f91ab368b7a79d9817197415

proft commented on 2014-02-12 07:55

Error occurred at last compilation:

tiff.cc:7:23: fatal error: tiff/tiff.h: No such file or directory
#include "tiff/tiff.h"
^
compilation terminated.
Makefile:2614: recipe for target 'build/tiff.o' failed
make: *** [build/tiff.o] Error 1
==> ERROR: A failure occurred in build().

VirtualTam commented on 2013-07-22 18:48

PKGBUILD updated to reflect the changes/fixes made upstream:
- locale fix no longer needed;
- no need to clean pkg/usr/share/app-install;
- updated dependencies.