Package Details: golden-cheetah-git v3.6.DEV2101.r160.99f73bdba-1

Git Clone URL: https://aur.archlinux.org/golden-cheetah-git.git (read-only, click to copy)
Package Base: golden-cheetah-git
Description: Cycling Power Analysis Software. We believe that cyclists and triathletes should be able to download their power data to the computer of their choice, analyze it in whatever way they see fit, and share their methods of analysis with others.
Upstream URL: http://www.goldencheetah.org/
Keywords: bike cheetah cycling gc golden
Licenses: GPL
Conflicts: golden-cheetah, golden-cheetah-dev, golden-cheetah-rc
Submitter: maxammann
Maintainer: maxammann
Last Packager: maxammann
Votes: 13
Popularity: 0.29
First Submitted: 2015-12-21 17:18
Last Updated: 2021-06-06 19:03

Latest Comments

« First ‹ Previous 1 2 3 4 5 Next › Last »

clb99978 commented on 2017-05-21 22:08

Hi:

I'm receiving this error when trying to build:

In file included from FileIO/D2XX.cpp:19:0:
FileIO/D2XX.h:27:20: fatal error: ftd2xx.h: No such file or directory
#include <ftd2xx.h>
^
compilation terminated.
make: *** [Makefile:108043: D2XX.o] Error 1
make: *** Waiting for unfinished jobs....
==> ERROR: A failure occurred in build().
Aborting...
==> ERROR: Makepkg was unable to build golden-cheetah-git.

keks commented on 2017-03-29 21:56

Hi,

I get the following error when trying to build:

In file included from Cloud/AddCloudWizard.cpp:19:0:
Cloud/AddCloudWizard.h:100:9: error: ‘QScrollArea’ does not name a type
QScrollArea *scrollarea;
^~~~~~~~~~~
Cloud/AddCloudWizard.cpp: In constructor ‘AddService::AddService(AddCloudWizard*)’:
Cloud/AddCloudWizard.cpp:123:5: error: ‘scrollarea’ was not declared in this scope
scrollarea=new QScrollArea(this);
^~~~~~~~~~
Cloud/AddCloudWizard.cpp:123:20: error: expected type-specifier before ‘QScrollArea’
scrollarea=new QScrollArea(this);

maxammann commented on 2017-02-16 10:07

@lestat70 thanks, added missing dependency

Anonymous comment on 2017-02-11 15:31

@maxammann
--------------
rm -f libkqoauth.a
ar cqs libkqoauth.a kqoauthmanager.o kqoauthrequest.o kqoauthutils.o kqoauthauthreplyserver.o kqoauthrequest_1.o kqoauthrequest_xauth.o moc_kqoauthmanager.o moc_kqoauthrequest.o moc_kqoauthrequest_xauth.o moc_kqoauthauthreplyserver.o moc_kqoauthauthreplyserver_p.o
Info: creating stash file /tmp/yaourt-tmp-carlos/aur-golden-cheetah-git/src/golden-cheetah/src/.qmake.stash
Project ERROR: Unknown module(s) in QT: charts
---------------------------------------------------------------

thamks

maxammann commented on 2016-05-28 12:00

@climbone @Artefact2 sorry for the delay updated the package

More info on this update:
https://bugreports.qt.io/browse/QTBUG-53367

climbone commented on 2016-05-27 20:13

Could you explain how to do it with this QMAKE_DEFAULT_INCDIRS= . What I should paste there. Thanks

AlexeyC commented on 2016-04-26 22:32

Thanks, compiled OK after manually added "qt5-connectivity".

maxammann commented on 2016-04-25 17:27

@AlexeyC Updated the package.

maxammann commented on 2016-04-19 21:27

@AlexeyC will look into it, thanks for reporting

AlexeyC commented on 2016-04-18 17:43

PfPvPlot.cpp multiple compillation errors on fresh/updated Arch, could you check it up, please.

Compiler output looks like:


PfPvPlot.cpp: In member function ‘void PfPvPlot::setData(RideItem*)’:
PfPvPlot.cpp:552:76: error: no matching function for call to ‘make_pair(double&, double&)’
dataSet.insert(std::make_pair<double, double>(aepf, cpv));
^
In file included from /usr/include/c++/5.3.0/utility:70:0,
from /usr/include/qt/QtCore/qcompilerdetection.h:928,
from /usr/include/qt/QtCore/qglobal.h:74,
from /usr/include/qt/QtCore/qchar.h:37,
from /usr/include/qt/QtCore/qstring.h:41,
from /usr/include/qt/QtCore/QString:1,
from GoldenCheetah.h:30,
from PfPvPlot.h:22,
from PfPvPlot.cpp:20:
/usr/include/c++/5.3.0/bits/stl_pair.h:276:5: note: candidate: template<class _T1, class _T2> constexpr std::pair<typename std::__decay_and_strip<_Tp>::__type, typename std::__decay_and_strip<_T2>::__type> std::make_pair(_T1&&, _T2&&)
make_pair(_T1&& __x, _T2&& __y)
^
/usr/include/c++/5.3.0/bits/stl_pair.h:276:5: note: template argument deduction/substitution failed:
PfPvPlot.cpp:552:76: note: cannot convert ‘aepf’ (type ‘double’) to type ‘double&&’
dataSet.insert(std::make_pair<double, double>(aepf, cpv));
^
PfPvPlot.cpp:564:87: error: no matching function for call to ‘make_pair(double&, double&)’
gearSet[0].insert(std::make_pair<double, double>(aepf, cpv));
^