Package Details: gnucap-geda-git r380.4fe0c54-1

Git Clone URL: https://aur.archlinux.org/gnucap-geda-git.git (read-only, click to copy)
Package Base: gnucap-geda-git
Description: gEDA extensions for Gnucap
Upstream URL: http://gnucap.org/
Licenses: GPL
Conflicts: gnucap-geda
Provides: gnucap-geda
Submitter: d_adler
Maintainer: d_adler
Last Packager: d_adler
Votes: 1
Popularity: 0.000000
First Submitted: 2016-10-14 20:11
Last Updated: 2017-11-12 22:51

Required by (0)

Sources (1)

Latest Comments

dreieck commented on 2021-03-16 15:03

Fails to check() for me:

==> Starting check()...
Making check in src
make[1]: Entering directory '/[...]/yay/gnucap-geda-git/src/gnucap-geda/src'
make[1]: Nothing to be done for 'check'.
make[1]: Leaving directory '/[...]/yay/gnucap-geda-git/src/gnucap-geda/src'
Making check in include
make[1]: Entering directory '/[...]/yay/gnucap-geda-git/src/gnucap-geda/include'
make[1]: Nothing to be done for 'check'.
make[1]: Leaving directory '/[...]/yay/gnucap-geda-git/src/gnucap-geda/include'
Making check in tests
make[1]: Entering directory '/[...]/yay/gnucap-geda-git/src/gnucap-geda/tests'
make  check-TESTS
make[2]: Entering directory '/[...]/yay/gnucap-geda-git/src/gnucap-geda/tests'
make[3]: Entering directory '/[...]/yay/gnucap-geda-git/src/gnucap-geda/tests'
XFAIL: comment.1.sch
PASS: connect.1.sch
PASS: connect.2.sch
PASS: connect.3.sch
PASS: connect.4.sch
PASS: connect.5.sch
PASS: connect.6.sch
PASS: connect.7.sch
PASS: eg1.sch
PASS: D_Latch.sch
PASS: eg1a.sch
PASS: eg15.sch
PASS: eg2.sch
PASS: eg2b.sch
PASS: eg25.sch
PASS: eg26.sch
PASS: eg3.sch
PASS: eg34.sch
XFAIL: eg34b.sch
PASS: eg4.sch
creating eg1_recon.gc
creating eg15_recon.gc
creating eg2_recon.gc
PASS: eg42.sch
creating eg2b_recon.gc
PASS: eg43.sch
creating eg25_recon.gc
creating eg26_recon.gc
creating eg3_recon.gc
creating eg34_recon.gc
creating eg4_recon.gc
PASS: eg5.sch
creating eg42_recon.gc
creating eg43_recon.gc
creating eg5_recon.gc
PASS: auto_top.1.gc
PASS: auto_top.1s.gc
XFAIL: auto_top.1g.gc
PASS: auto_top.1ge.gc
PASS: auto_top.2.gc
PASS: auto_top.3a.gc
PASS: auto_top.3.gc
PASS: auto_top.3b.gc
XFAIL: auto_top.4.gc
PASS: buf.1.gc
PASS: d_gedasckt.2.gc
PASS: buf.2.gc
PASS: d_gedasckt.3.gc
PASS: d_gedasckt.4.gc
PASS: d_gedasckt.5.gc
PASS: d_gedasckt.6.gc
PASS: d_gedasckt.7.gc
PASS: nesting.gc
PASS: rail.gc
FAIL: spice.gc
PASS: res_net.gc
PASS: rc.2.gc
PASS: rc.gc
PASS: res.gc
PASS: short.gc
PASS: testbench.gc
PASS: convert.gc
PASS: inv_tr.gc
PASS: dlatch_tr.gc
PASS: hide.1.gc
PASS: d_gedasckt.1.gc
PASS: invtb.gc
PASS: error.1.gc
PASS: notfound.gc
PASS: switch.1.gc
PASS: verilog.gc
PASS: verilog_place.gc
PASS: nets.sch
gnucap eg1_recon.gc
PASS: bogus.sch
gnucap eg15_recon.gc
gnucap eg2_recon.gc
** Message: 16:02:01.922: Loaded RC file [/usr/share/gEDA/system-gafrc]

** Message: 16:02:01.926: Loaded RC file [/[...]/yay/gnucap-geda-git/src/gnucap-geda/tests/gafrc]

@@#
@@@
incomplete:lang_geda.cc:1787:print_module
** Message: 16:02:01.966: Loaded RC file [/usr/share/gEDA/system-gafrc]

** Message: 16:02:01.970: Loaded RC file [/[...]/yay/gnucap-geda-git/src/gnucap-geda/tests/gafrc]

@@#
@@@
incomplete:lang_geda.cc:1787:print_module
@@#
@@@
incomplete:symbol.h:84:label
@@#
@@@
incomplete:symbol.h:84:label
gnucap eg2b_recon.gc
PASS: divide_by_two.gc
gnucap eg25_recon.gc
** Message: 16:02:02.046: Loaded RC file [/usr/share/gEDA/system-gafrc]

** Message: 16:02:02.057: Loaded RC file [/[...]/yay/gnucap-geda-git/src/gnucap-geda/tests/gafrc]

@@#
@@@
incomplete:d_gedasckt.cc:251:default_connect
@@#
@@@
incomplete:d_gedasckt.cc:251:default_connect
@@#
@@@
incomplete:lang_geda.cc:1787:print_module
@@#
@@@
incomplete:symbol.h:84:label
@@#
@@@
incomplete:symbol.h:84:label
** Message: 16:02:02.074: Loaded RC file [/usr/share/gEDA/system-gafrc]

** Message: 16:02:02.078: Loaded RC file [/[...]/yay/gnucap-geda-git/src/gnucap-geda/tests/gafrc]

gnucap eg26_recon.gc
@@#
@@@
incomplete:d_gedasckt.cc:251:default_connect
@@#
@@@
incomplete:d_gedasckt.cc:251:default_connect
@@#
@@@
incomplete:d_gedasckt.cc:251:default_connect
@@#
@@@
incomplete:d_gedasckt.cc:251:default_connect
@@#
@@@
incomplete:d_gedasckt.cc:251:default_connect
@@#
@@@
incomplete:d_gedasckt.cc:251:default_connect
@@#
@@@
incomplete:d_gedasckt.cc:251:default_connect
@@#
@@@
incomplete:d_gedasckt.cc:251:default_connect
@@#
@@@
incomplete:lang_geda.cc:1787:print_module
@@#
@@@
incomplete:lang_geda.cc:1787:print_module
** Message: 16:02:02.132: Loaded RC file [/usr/share/gEDA/system-gafrc]

gnucap eg3_recon.gc
** Message: 16:02:02.137: Loaded RC file [/[...]/yay/gnucap-geda-git/src/gnucap-geda/tests/gafrc]

@@#
@@@
incomplete:lang_geda.cc:1787:print_module
@@#
@@@
incomplete:symbol.h:84:label
@@#
@@@
incomplete:symbol.h:84:label
@@#
@@@
incomplete:symbol.h:84:label
@@#
@@@
incomplete:symbol.h:84:label
@@#
@@@
incomplete:symbol.h:84:label
@@#
@@@
incomplete:lang_geda.cc:1672:print_component
** Message: 16:02:02.164: Loaded RC file [/usr/share/gEDA/system-gafrc]

gnucap eg34_recon.gc
** Message: 16:02:02.168: Loaded RC file [/[...]/yay/gnucap-geda-git/src/gnucap-geda/tests/gafrc]

@@#
@@@
incomplete:d_gedasckt.cc:251:default_connect
@@#
@@@
incomplete:d_gedasckt.cc:251:default_connect
@@#
@@@
incomplete:d_gedasckt.cc:251:default_connect
@@#
@@@
incomplete:d_gedasckt.cc:251:default_connect
@@#
@@@
incomplete:d_gedasckt.cc:251:default_connect
@@#
@@@
incomplete:d_gedasckt.cc:251:default_connect
@@#
@@@
incomplete:d_gedasckt.cc:251:default_connect
@@#
@@@
incomplete:d_gedasckt.cc:251:default_connect
@@#
@@@
incomplete:d_gedasckt.cc:251:default_connect
@@#
@@@
incomplete:lang_geda.cc:1787:print_module
** Message: 16:02:02.216: Loaded RC file [/usr/share/gEDA/system-gafrc]

gnucap eg4_recon.gc
** Message: 16:02:02.221: Loaded RC file [/[...]/yay/gnucap-geda-git/src/gnucap-geda/tests/gafrc]

** Message: 16:02:02.247: Loaded RC file [/usr/share/gEDA/system-gafrc]

** Message: 16:02:02.251: Loaded RC file [/[...]/yay/gnucap-geda-git/src/gnucap-geda/tests/gafrc]

@@#
@@@
incomplete:lang_geda.cc:1787:print_module
gnucap eg42_recon.gc
** Message: 16:02:02.304: Loaded RC file [/usr/share/gEDA/system-gafrc]

gnucap eg43_recon.gc
** Message: 16:02:02.309: Loaded RC file [/[...]/yay/gnucap-geda-git/src/gnucap-geda/tests/gafrc]

@@#
@@@
incomplete:lang_geda.cc:1787:print_module
@@#
@@@
incomplete:symbol.h:84:label
@@#
@@@
incomplete:symbol.h:84:label
** Message: 16:02:02.354: Loaded RC file [/usr/share/gEDA/system-gafrc]

** Message: 16:02:02.358: Loaded RC file [/[...]/yay/gnucap-geda-git/src/gnucap-geda/tests/gafrc]

gnucap eg5_recon.gc
@@#
@@@
incomplete:lang_geda.cc:1787:print_module
@@#
@@@
incomplete:lang_geda.cc:1787:print_module
@@#
@@@
incomplete:symbol.h:84:label
@@#
@@@
incomplete:symbol.h:84:label
@@#
@@@
incomplete:symbol.h:84:label
@@#
@@@
incomplete:symbol.h:84:label
@@#
@@@
incomplete:symbol.h:84:label
@@#
@@@
incomplete:symbol.h:84:label
@@#
@@@
incomplete:symbol.h:84:label
@@#
@@@
incomplete:symbol.h:84:label
** Message: 16:02:02.396: Loaded RC file [/usr/share/gEDA/system-gafrc]

** Message: 16:02:02.400: Loaded RC file [/[...]/yay/gnucap-geda-git/src/gnucap-geda/tests/gafrc]

** Message: 16:02:02.437: Loaded RC file [/usr/share/gEDA/system-gafrc]

** Message: 16:02:02.442: Loaded RC file [/[...]/yay/gnucap-geda-git/src/gnucap-geda/tests/gafrc]

@@#
@@@
incomplete:lang_geda.cc:1787:print_module
@@#
@@@
incomplete:symbol.h:84:label
PASS: eg1_recon.gc
PASS: eg2_recon.gc
PASS: eg15_recon.gc
PASS: eg2b_recon.gc
XFAIL: eg25_recon.gc
XFAIL: eg26_recon.gc
PASS: eg3_recon.gc
PASS: eg34_recon.gc
PASS: eg4_recon.gc
PASS: eg42_recon.gc
PASS: eg43_recon.gc
PASS: eg5_recon.gc
============================================================================
Testsuite summary for gnucap-geda 0.0.3-rc5
============================================================================
# TOTAL: 75
# PASS:  68
# SKIP:  0
# XFAIL: 6
# FAIL:  1
# XPASS: 0
# ERROR: 0
============================================================================
See tests/test-suite.log
Please report to felix@salfelder.org
============================================================================
make[3]: *** [Makefile:696: test-suite.log] Error 1
make[3]: Leaving directory '/[...]/yay/gnucap-geda-git/src/gnucap-geda/tests'
make[2]: *** [Makefile:804: check-TESTS] Error 2
make[2]: Leaving directory '/[...]/yay/gnucap-geda-git/src/gnucap-geda/tests'
make[1]: *** [Makefile:898: check-am] Error 2
make[1]: Leaving directory '/[...]/yay/gnucap-geda-git/src/gnucap-geda/tests'
make: *** [Makefile:483: check-recursive] Error 1
==> ERROR: A failure occurred in check().

Thanks for maintaining!