Package Details: ghdl 0.36-1

Git Clone URL: https://aur.archlinux.org/ghdl.git (read-only)
Package Base: ghdl
Description: VHDL simulator
Upstream URL: https://github.com/ghdl/ghdl
Licenses: GPLv2
Submitter: xyproto
Maintainer: vicencb
Last Packager: vicencb
Votes: 30
Popularity: 0.137337
First Submitted: 2011-12-14 17:03
Last Updated: 2019-03-03 15:20

Latest Comments

« First ‹ Previous 1 2 3 4 5

lintz commented on 2013-09-13 18:59

subversion should be listed as dependency

and it fails for me x86_64

-> Extracting gcc-4.7.3.tar.bz2 with bsdtar
==> Starting build()...
/tmp/packerbuild-0/ghdl/ghdl/PKGBUILD: rad 22: cd: /tmp/packerbuild-0/ghdl/ghdl/src/ghdl/translate/gcc: File or folder don't exist
==> ERROR:A error occurred in the build().
Cancelling...
The build failed.

lintz commented on 2013-09-13 18:54

subversion should be listed as a dependency

lintz commented on 2013-09-13 18:48

Not working for me on x86_64

"==> Checking runtime dependencies...
==> Checking buildtime dependencies...
==> Retrieving sources...
-> Cloning ghdl svn repo...
/usr/bin/makepkg: rad 709: svn: commando don't exist
==> ERROR: Failure while downloading ghdl svn repo
Cancelling...
The build failed.
"

vicencb commented on 2013-08-24 00:53

Tested on x86_64, awaiting feedback for i686.

Astaoth commented on 2013-04-05 14:06

I can't compile too, with a 64 bits.

echo @set srcdir /tmp/yaourt-tmp-alucard/aur-ghdl/src/gcc-4.3.4/host-x86_64-unknown-linux-gnu/gcc/../.././gcc >> gcc-vers.texiT
if [ -n "(GCC) " ]; then \
echo "@set VERSION_PACKAGE (GCC) " >> gcc-vers.texiT; \
fi
echo "@set BUGURL @uref{http://gcc.gnu.org/bugs.html}" >> gcc-vers.texiT; \
mv -f gcc-vers.texiT gcc-vers.texi
if [ xinfo = xinfo ]; then \
makeinfo --split-size=5000000 --split-size=5000000 --no-split -I . -I ../.././gcc/doc \
-I ../.././gcc/doc/include -o doc/cpp.info ../.././gcc/doc/cpp.texi; \
fi
../../gcc/doc/cppopts.texi:757: @itemx doit suivre @item
make[2]: *** [doc/cpp.info] Erreur 1
make[2] : on quitte le répertoire « /tmp/yaourt-tmp-alucard/aur-ghdl/src/gcc-4.3.4/host-x86_64-unknown-linux-gnu/gcc »
make[1]: *** [all-gcc] Erreur 2
make[1] : on quitte le répertoire « /tmp/yaourt-tmp-alucard/aur-ghdl/src/gcc-4.3.4 »
make: *** [all] Erreur 2

voeler commented on 2013-03-10 13:53

Same error here, cannot compile.

earlz commented on 2012-08-08 04:08

This is broken for me with latest packages on 32bit. The error I get is:

In file included from ../.././libgcc/../gcc/unwind-dw2.c:338:
../.././libgcc/../gcc/config/i386/linux-unwind.h: In function ‘x86_fallback_frame_state’:
../.././libgcc/../gcc/config/i386/linux-unwind.h:142: error: field ‘info’ has incomplete type
make[2]: *** [unwind-dw2.o] Error 1

xyproto commented on 2011-12-14 17:24

Moved from [community] in connection with the Christmas Cleanup https://wiki.archlinux.org/index.php/Christmas_Cleanup.