Package Details: galapix 0.2.1-3

Git Clone URL: https://aur.archlinux.org/galapix.git (read-only)
Package Base: galapix
Description: A zoomable image viewer for large collections of images
Upstream URL: https://github.com/Galapix/galapix
Licenses: GPL3
Submitter: Dragonlord
Maintainer: None
Last Packager: haawda
Votes: 11
Popularity: 0.000116
First Submitted: 2010-12-05 19:36
Last Updated: 2018-09-11 04:25

Latest Comments

« First ‹ Previous 1 2

Dragonlord commented on 2014-12-05 17:45

md5sum was correct at the time of package upload, value changed, some more info here: https://github.com/svetlemodry/aur-pkgbuilds/commit/133e2a039be1bc477e7aa9ab08a553ee3c42b889

jwm-art commented on 2014-12-05 13:06

md5sum needs updating for galapix-0.2.1.tar.gz

Zeniff commented on 2014-05-05 03:44

It seems it has recent activity in git (original author, not forked one on AUR), but nothing released yet.

aricart commented on 2013-10-14 13:00

galapix-git is working and maintained.

aricart commented on 2013-03-15 12:24

Same here. I'm about to create a git version of this package just to test if it works since the repository is much newer than this release.

antihero commented on 2012-08-28 23:58

I'm getting this error:


scons: building associated VariantDir targets: build
g++ -o build/src/sqlite/connection.o -c -O3 -s -isystem/usr/include/libpng15 -isystem/usr/include/SDL -isystem/usr/include/ImageMagick -D_GNU_SOURCE=1 -D_REENTRANT -Ibuild/src -Isrc src/sqlite/connection.cpp
src/sqlite/connection.cpp: In function 'int busy_callback(void*, int)':
src/sqlite/connection.cpp:28:17: error: 'usleep' was not declared in this scope

Dragonlord commented on 2012-07-14 07:43

Was this reported upstream?

qubodup commented on 2012-03-20 15:51

Thanks for providing this package!

When trying to compile, I run into an error:


src/plugins/png.cpp: In function 'void readPNGMemory(png_structp, png_bytep, png_size_t)':
src/plugins/png.cpp:34:59: error: invalid use of incomplete type 'png_struct {aka struct png_struct_def}'
/usr/include/libpng15/png.h:855:16: error: forward declaration of 'png_struct {aka struct png_struct_def}'
src/plugins/png.cpp: In static member function 'static bool PNG::get_size(void*, int, Size&)':
src/plugins/png.cpp:54:7: error: invalid use of incomplete type 'png_struct {aka struct png_struct_def}'
/usr/include/libpng15/png.h:855:16: error: forward declaration of 'png_struct {aka struct png_struct_def}'
src/plugins/png.cpp: In static member function 'static bool PNG::get_size(const string&, Size&)':
src/plugins/png.cpp:92:9: error: invalid use of incomplete type 'png_struct {aka struct png_struct_def}'
/usr/include/libpng15/png.h:855:16: error: forward declaration of 'png_struct {aka struct png_struct_def}'
src/plugins/png.cpp: In static member function 'static SoftwareSurfaceHandle PNG::load_from_file(const string&)':
src/plugins/png.cpp:127:9: error: invalid use of incomplete type 'png_struct {aka struct png_struct_def}'
/usr/include/libpng15/png.h:855:16: error: forward declaration of 'png_struct {aka struct png_struct_def}'
src/plugins/png.cpp: In static member function 'static SoftwareSurfaceHandle PNG::load_from_mem(uint8_t*, int)':
src/plugins/png.cpp:201:7: error: invalid use of incomplete type 'png_struct {aka struct png_struct_def}'
/usr/include/libpng15/png.h:855:16: error: forward declaration of 'png_struct {aka struct png_struct_def}'
src/plugins/png.cpp: In static member function 'static void PNG::save(const SoftwareSurfaceHandle&, const string&)':
src/plugins/png.cpp:275:9: error: invalid use of incomplete type 'png_struct {aka struct png_struct_def}'
/usr/include/libpng15/png.h:855:16: error: forward declaration of 'png_struct {aka struct png_struct_def}'
src/plugins/png.cpp: In function 'void writePNGMemory(png_structp, png_bytep, png_size_t)':
src/plugins/png.cpp:317:61: error: invalid use of incomplete type 'png_struct {aka struct png_struct_def}'
/usr/include/libpng15/png.h:855:16: error: forward declaration of 'png_struct {aka struct png_struct_def}'
src/plugins/png.cpp: In static member function 'static BlobHandle PNG::save(const SoftwareSurfaceHandle&)':
src/plugins/png.cpp:329:7: error: invalid use of incomplete type 'png_struct {aka struct png_struct_def}'
/usr/include/libpng15/png.h:855:16: error: forward declaration of 'png_struct {aka struct png_struct_def}'
scons: *** [build/src/plugins/png.o] Error 1
scons: building terminated because of errors.
==> ERROR: A failure occurred in build().
Aborting...
==> ERROR: Makepkg was unable to build galapix.
==> Restart building galapix ? [y/N]
==> --------------------------------
==>
==> WARNING: Following packages have not been installed:
galapix

Anonymous comment on 2011-03-27 17:27

Due to some changes in libboost-1.40.0, libraries are no longer named with a "-mt" suffix. Linking fails unless these suffixes are removed from the SConscript file.

Here is a patch that applies these changes: http://pastebin.com/raw.php?i=1QAf4q05

Dragonlord commented on 2010-12-05 19:36

Initial upload