Package Details: freefem 4.5-1

Git Clone URL: https://aur.archlinux.org/freefem.git (read-only, click to copy)
Package Base: freefem
Description: A PDE oriented language using the finite element method
Upstream URL: https://freefem.org/index.html
Licenses: LGPL
Conflicts: freefem++
Provides: freefem++
Submitter: haawda
Maintainer: Sosthene
Last Packager: Sosthene
Votes: 16
Popularity: 0.95
First Submitted: 2019-06-19 19:31
Last Updated: 2020-02-13 22:01

Latest Comments

« First ‹ Previous ... 3 4 5 6 7 8

mrbit commented on 2012-05-26 12:39

ok, thanks

Anonymous comment on 2012-05-26 11:40

Updated:
- Removed '--disable-pdf' option.
- Added '--enable-download' option.
- Added PDF manual to the package.

mrbit commented on 2012-05-24 16:25

modified PKGBUILD :

--enable-download
# --disable-pdf

has completed....

mrbit commented on 2012-05-24 16:13

Output written on freefem++doc.pdf (378 pages, 9511141 bytes).
Transcript written on freefem++doc.log.
make[2]: *** [freefem++doc.pdf] Errore 1
make[2]: Leaving directory `/tmp/packerbuild-0/freefem/freefem/src/freefem++-3.19-1/DOC'
make[1]: *** [all-recursive] Errore 1
make[1]: Leaving directory `/tmp/packerbuild-0/freefem/freefem/src/freefem++-3.19-1'
make: *** [all] Errore 2
==> ERRORE:

mrbit commented on 2012-05-24 16:12

For additional information on amsmath, use the `?' option.
(/usr/share/texmf-dist/tex/latex/amsmath/amstext.sty
(/usr/share/texmf-dist/tex/latex/amsmath/amsgen.sty))
(/usr/share/texmf-dist/tex/latex/amsmath/amsbsy.sty)
(/usr/share/texmf-dist/tex/latex/amsmath/amsopn.sty))
(/usr/share/texmf-dist/tex/latex/base/textcomp.sty
(/usr/share/texmf-dist/tex/latex/base/ts1enc.def))

! LaTeX Error: File `gensymb.sty' not found.

Type X to quit or <RETURN> to proceed,
or enter new name. (Default extension: sty)

Enter file name: ??????

not compila..!!!!

Anonymous comment on 2012-05-24 12:53

@mrbit
Hmm, documentation building should be disabled by the "--disable-pdf" option... Okay, I fixed it. Thanks for report.

mrbit commented on 2012-05-24 11:43

! LaTeX Error: File `gensymb.sty' not found.

Type X to quit or <RETURN> to proceed,
or enter new name. (Default extension: sty)

Enter file name: ????????