Package Details: freefem 4.5-1

Git Clone URL: https://aur.archlinux.org/freefem.git (read-only, click to copy)
Package Base: freefem
Description: A PDE oriented language using the finite element method
Upstream URL: https://freefem.org/index.html
Licenses: LGPL
Conflicts: freefem++
Provides: freefem++
Submitter: haawda
Maintainer: Sosthene
Last Packager: Sosthene
Votes: 16
Popularity: 0.82
First Submitted: 2019-06-19 19:31
Last Updated: 2020-02-13 22:01

Latest Comments

« First ‹ Previous 1 2 3 4 5 6 7 8 Next › Last »

holos commented on 2013-01-09 02:29

umfpack is provided by suitesparse in extra

mrbit commented on 2013-01-08 10:55

sorry, for bad english,
conflicts=('umfpack') !!!!
there is no package "umfpack" in the AUR !!!

holos commented on 2013-01-08 05:48

it builds just fine here. updated with umfpack as a conflict.

mrbit commented on 2013-01-03 12:21

no work...
make[5]: Leaving directory `/home/mrbit/aur3/freefem++/src/freefem++-3.20/download/umfpack/SuiteSparse/AMD/Doc'
make[4]: Leaving directory `/home/mrbit/aur3/freefem++/src/freefem++-3.20/download/umfpack/SuiteSparse/AMD'
rm: operando mancante
Try 'rm --help' for more information.
make[3]: [SuiteSparse/UFconfig/UFconfig.mk] Errore 123 (ignorato)
touch SuiteSparse/UFconfig/UFconfig.mk
touch SuiteSparse/FF
cd SuiteSparse/UMFPACK/Source && make
cd SuiteSparse/AMD/Source && make
make[4]: Entering directory `/home/mrbit/aur3/freefem++/src/freefem++-3.20/download/umfpack/SuiteSparse/AMD/Source'
gcc -I../../AMD/Include -I../../UFconfig -march=corei7-avx -mtune=generic -pipe -fstack-protector --param=ssp-buffer-size=4 -D_FORTIFY_SOURCE=2 -DNDEBUG -O3 -mmmx -msse -msse2 -fPIC -I../Include -I../../UFconfig -c amd_global.c -o amd_global.o
make[4]: *** lettura della pipe dei processi: Argomento non valido. Stop.
make[4]: *** Attesa dei processi non terminati....
make[4]: Entering directory `/home/mrbit/aur3/freefem++/src/freefem++-3.20/download/umfpack/SuiteSparse/UMFPACK/Source'
gcc -I../../AMD/Include -I../../UFconfig -march=corei7-avx -mtune=generic -pipe -fstack-protector --param=ssp-buffer-size=4 -D_FORTIFY_SOURCE=2 -DNDEBUG -O3 -mmmx -msse -msse2 -fPIC -I../Include -I../../AMD/Include -I../../UFconfig -DDINT -c umf_analyze.c -o umf_i_analyze.o
make[4]: *** lettura della pipe dei processi: Argomento non valido. Stop.
make[4]: *** Attesa dei processi non terminati....
make[4]: Leaving directory `/home/mrbit/aur3/freefem++/src/freefem++-3.20/download/umfpack/SuiteSparse/AMD/Source'
make[3]: *** [../lib/libamd.a] Errore 2
make[3]: *** Attesa dei processi non terminati....
make[4]: Leaving directory `/home/mrbit/aur3/freefem++/src/freefem++-3.20/download/umfpack/SuiteSparse/UMFPACK/Source'
make[3]: *** [../lib/libumfpack.a] Errore 2
make[3]: Leaving directory `/home/mrbit/aur3/freefem++/src/freefem++-3.20/download/umfpack'
make[2]: *** [all-recursive] Errore 1
make[2]: Leaving directory `/home/mrbit/aur3/freefem++/src/freefem++-3.20/download'
make[1]: *** [all-recursive] Errore 1
make[1]: Leaving directory `/home/mrbit/aur3/freefem++/src/freefem++-3.20'
make: *** [all] Errore 2
==> ERRORE:

mrbit commented on 2012-11-26 12:13

ok, now work : unistalled suitesparse....!!

mrbit commented on 2012-11-26 07:43

installed suitesparse 4.0.2

mrbit commented on 2012-11-26 07:01

how to do that ??

holos commented on 2012-11-26 05:09

have you tried uninstalling umfpack before trying to build?

mrbit commented on 2012-11-25 09:25

i'm using makepkg, but still don't work !!!

holos commented on 2012-11-14 22:04

yaourt is probably automatically downloading umfpack for suitesparse. Read lazork's comment. Use makepkg.