Package Details: fontconfig-infinality 2.13.1+12+g5f5ec56-1

Git Clone URL: https://aur.archlinux.org/fontconfig-infinality.git (read-only)
Package Base: fontconfig-infinality
Description: A library for configuring and customizing font access, optimized for freetype2-infinality.
Upstream URL: http://www.fontconfig.org/release/
Licenses: custom, MIT
Conflicts: fontconfig, fontconfig-infinality, fontconfig-infinality-git, fontconfig-infinality-ultimate-git
Provides: fontconfig=$pkgver, fontconfig-infinality, fontconfig-infinality-ultimate
Replaces: fontconfig-iu-comp
Submitter: Shanto
Maintainer: SolarAquarion
Last Packager: SolarAquarion
Votes: 310
Popularity: 0.000243
First Submitted: 2011-12-24 23:30
Last Updated: 2019-05-30 01:59

Required by (1000)

Sources (8)

Latest Comments

« First ‹ Previous ... 2 3 4 5 6 7 8 9 10 Next › Last »

Anonymous comment on 2015-09-01 11:29

Sorry graysky, that's a leftover from the previous version. I'll fix it!

graysky commented on 2015-09-01 11:17

The install.sh supplies bad info:

1) There is no /etc/fonts/conf.d/52-infinality.conf
2) The README is located here: /usr/etc/fonts/conf.d/README

graysky commented on 2015-09-01 11:15

install.sh supplies bad info, there is no /etc/fonts/conf.d/52-infinality.conf

Anonymous comment on 2015-08-31 11:35

No maintainer anymore? Hmm...

xyproto commented on 2015-02-06 14:05

After installing this package, inkscape segfaults at start. Anyone else experienced this?

Marcel_K commented on 2014-12-31 00:49

I didn't mark it, I just asked to reverse pkgver and pkgrel, as they are wrong now, from an Arch Linux point-of-view.

hadrons123 commented on 2014-12-30 22:36

Believe it or not its the latest upstream version. Its has not been updated since then ! Please stop marking it as outdated.

Marcel_K commented on 2014-12-30 22:23

The version and pkgrel are wrong: pkgrel should be used when updating a PKGBUILD or patch, but not the upstream version itself. Now pkgrel contains a version and pkgver the release number.

graysky commented on 2013-10-10 15:34

Looks like a newer release is out: freetype-infinality-2.4.12-20130514_01-x86_64.tar.bz2

dflt commented on 2013-01-12 19:20

It's failing for me:


2 out of 6 hunks FAILED -- saving rejects to file src/base/ftobjs.c.rej
patching file src/base/ftoutln.c
Hunk #1 FAILED at 904.
1 out of 1 hunk FAILED -- saving rejects to file src/base/ftoutln.c.rej
patching file src/base/ftsynth.c
Hunk #1 FAILED at 88.
Hunk #2 FAILED at 101.
Hunk #3 FAILED at 141.
3 out of 3 hunks FAILED -- saving rejects to file src/base/ftsynth.c.rej
patching file src/smooth/ftsmooth.c
Hunk #1 succeeded at 15 with fuzz 2 (offset -11 lines).
Hunk #2 FAILED at 75.
Hunk #3 succeeded at 2882 (offset 2767 lines).
Hunk #4 succeeded at 2900 (offset 2767 lines).
Hunk #5 succeeded at 3392 (offset 2767 lines).
Hunk #6 succeeded at 3501 (offset 2767 lines).
Hunk #7 succeeded at 3578 (offset 2767 lines).
Hunk #8 FAILED at 838.
Hunk #9 FAILED at 893.
3 out of 9 hunks FAILED -- saving rejects to file src/smooth/ftsmooth.c.rej
==> ERROR: A failure occurred in build().
Aborting...