Package Details: fim 0.6-1

Git Clone URL: (read-only, click to copy)
Package Base: fim
Description: FIM (Fbi IMproved) is a highly customizable and scriptable image viewer.
Upstream URL:
Licenses: GPL2
Conflicts: fim-svn
Submitter: Dragonlord
Maintainer: meanjollies
Last Packager: meanjollies
Votes: 24
Popularity: 0.002461
First Submitted: 2008-02-27 17:02
Last Updated: 2019-06-15 03:00

Latest Comments

1 2 3 4 Next › Last »

oriba commented on 2019-06-06 14:14

Please update the package. Also, please add the font-dependency: package 'terminus-font' is needed.

bartus commented on 2019-04-04 13:09

libexif missing form depends

basedtho commented on 2016-11-08 02:02

Please add libexif to the dependencies

Although it doesn't compile even if I install libexif, it shows the following error message:

g++ -DHAVE_CONFIG_H -I. -I.. -march=x86-64 -mtune=generic -O2 -pipe -fstack-protector-strong -c -o CommandConsole-init.o CommandConsole-init.cpp
CommandConsole-init.cpp: In member function ‘fim_err_t fim::CommandConsole::init(fim::string)’:
CommandConsole-init.cpp:258:17: error: ‘FIM_WITH_LIBSDL’ was not declared in this scope
|| device==FIM_WITH_LIBSDL
make[4]: *** [Makefile:780: CommandConsole-init.o] Error 1
make[4]: Leaving directory '/home/budkin/.cache/pacaur/fim/src/fim-0.5-rc2/src'
make[3]: *** [Makefile:813: all-recursive] Error 1
make[3]: Leaving directory '/home/budkin/.cache/pacaur/fim/src/fim-0.5-rc2/src'
make[2]: *** [Makefile:441: all] Error 2
make[2]: Leaving directory '/home/budkin/.cache/pacaur/fim/src/fim-0.5-rc2/src'
make[1]: *** [Makefile:435: all-recursive] Error 1
make[1]: Leaving directory '/home/budkin/.cache/pacaur/fim/src/fim-0.5-rc2'
make: *** [Makefile:346: all] Error 2
==> ERROR: A failure occurred in build().
:: failed to build fim package(s)

anntzer commented on 2016-07-07 18:55

Regarding the message

==> To get fim to work after you've installed it, place the following export in
==> your ~/.profile file:
==> export FBFONT=/usr/share/kbd/consolefonts/ter-216n.psf.gz

This font is not provided by the package, and setting FBFONT as suggested results in the error message:

font "/usr/share/kbd/consolefonts/ter-216n.psf.gz" is not available

stevenhoneyman commented on 2014-10-11 16:49

flex and bison are both in base-devel.

"Warning: Packages in the AUR assume the base-devel group is installed, and AUR packages will not list members of this group as dependencies even if the package cannot be built without them. Please ensure this group is installed before complaining about failed builds." - Arch wiki

kaze commented on 2014-10-11 16:45

This package also requires core/flex and core/bison to build.

stevenhoneyman commented on 2014-07-08 21:47

Fixed. Shame it doesn't support PSF2 fonts - though the inbuilt is OK.
...Now if only I could make it work on KMSCON...

quite commented on 2014-07-08 21:34

You might as well take it, I'm not stuck in console often nowdays :)

stevenhoneyman commented on 2014-07-08 21:31

Either/or is fine by me :)
Here's a fix to run in prepare():

sed -i -e 's#\(DGifCloseFile(h->gif\));#\1, \&h->ErrorCode);#' \
-e 's#char .Err#const &#' src/FbiStuffGif.cpp

...that's the reason I flagged the orphan request though, nothing personal - just saw it was broken and knew I could fix it.

quite commented on 2014-07-08 21:26

You're welcome to submit a working PKGBUILD. And then again when upstream fixes it. (Or take over maintenance)