Package Details: ffmpeg-full 4.4-1

Git Clone URL: https://aur.archlinux.org/ffmpeg-full.git (read-only, click to copy)
Package Base: ffmpeg-full
Description: Complete solution to record, convert and stream audio and video (all possible features including libfdk-aac)
Upstream URL: https://www.ffmpeg.org/
Keywords: audio codec convert cuda cuvid decklink encoder fdk-aac fdkaac hwaccel libnpp media nvenc svt video
Licenses: custom: nonfree and unredistributable
Conflicts: ffmpeg
Provides: ffmpeg, libavcodec.so, libavdevice.so, libavfilter.so, libavformat.so, libavresample.so, libavutil.so, libpostproc.so, libswresample.so, libswscale.so
Submitter: rpolzer
Maintainer: dbermond
Last Packager: dbermond
Votes: 106
Popularity: 1.00
First Submitted: 2013-01-24 11:17
Last Updated: 2021-04-09 22:04

Dependencies (113)

Required by (1000)

Sources (8)

Latest Comments

« First ‹ Previous ... 2 3 4 5 6 7 8 9 10 11 12 ... Next › Last »

N3oTraX commented on 2019-12-12 19:29

Hi,

yay -S -d x265

Worked as a charm for me ;)

smoneck commented on 2019-11-22 12:37

Same as Verequies here with vmaf 1.3.15:

-> Running ffmpeg configure script... ERROR: libvmaf >= 1.3.9 not found using pkg-config.

Confirming it compiles successfully without --enable-libvmaf.

dbermond commented on 2019-11-16 13:54

@FraYoshi You need to rebuild ffmpeg-full every time that one of its dependencies get a soname bump. In this case, dav1d got a soname bump when upgrading it from 0.4.0 to 0.5.0.

FraYoshi commented on 2019-11-16 12:40

ffmpeg-full breaks chromium (/usr/lib/chromium/chromium: error while loading shared libraries: libdav1d.so.2: cannot open shared object file: No such file or directory) and NetFlix (Error Code: F7355) for me...

Solved replacing with ffmpeg standard

Gatenkaas commented on 2019-11-08 17:41

Fails with x265 (3.2.1-1), dependency 'libx265.so=176-64' Obviously there is no automatic code update when a so-name bump occurs. The solution therefore is to force the installation of 'x265' with 'yay -S -d x265' and then rebuild with 'yay -S ffmpeg-full-nvenc'.

dbermond commented on 2019-08-22 17:31

@ganthore

1) hm is not a dependency for ffmpeg-full, so it's not needed here. vmaf and blackmagic-decklink-sdk are already in makedepends.

pocketsphinx currently builds fine for me. If you have any concerns about pocketsphinx please direct it to its package maintainer.

2) nvcc path is not missing, this was already answered. Please see the 2 comments from 2019-06-11. In short: nvcc path is handled by makepkg because it automatically sources the profile file when pulling and installing cuda.

ffmpeg-full is building fine in a chroot with devtools so it builds fine in a fresh Arch install.

ganthore commented on 2019-08-22 15:48

There are two problems that need to be corrected with the PKGBUILD.

1) Missing or broken deps

On a fresh install of arch, the PKGBUILD building phase will fail due to the following packages not being set as dependencies:

hm (required for kvazaar to build) vmaf blackmagic-decklink-sdk

Also note that the pocketsphinx PKGBUILD is broken, so it may be better to use the pocketsphinx-git package as a workaround.

2) nvcc is missing

The build process will fail because you're assuming people have /opt/cuda/bin in their system or root shell path. An easy workaround is to export this into the PATH during the build phase: "export PATH=$PATH:/opt/cuda/bin"

craeckie commented on 2019-08-13 10:29

strange, I had intel-svt-hevc installed at 1.4.0-1. Still, after rebuilding and installing it, I was able to build ffmpeg.

dbermond commented on 2019-08-12 19:15

@craeckie Package is building fine. Please make sure that you have an updated intel-svt-hevc (currently at 1.4.0-1).

craeckie commented on 2019-08-12 09:19

I'm getting this error when building:

CC      libavcodec/libtheoraenc.o
libavcodec/libsvt_hevc.c: In function ‘config_enc_params’:
libavcodec/libsvt_hevc.c:140:14: error: ‘EB_H265_ENC_CONFIGURATION’ {aka ‘struct EB_H265_ENC_CONFIGURATION’} has no member named ‘encoderColorFormat’
  140 |         param->encoderColorFormat = EB_YUV420;
      |              ^~
libavcodec/libsvt_hevc.c:140:37: error: ‘EB_YUV420’ undeclared (first use in this function)
  140 |         param->encoderColorFormat = EB_YUV420;
      |                                     ^~~~~~~~~
libavcodec/libsvt_hevc.c:140:37: note: each undeclared identifier is reported only once for each function it appears in
libavcodec/libsvt_hevc.c:143:14: error: ‘EB_H265_ENC_CONFIGURATION’ {aka ‘struct EB_H265_ENC_CONFIGURATION’} has no member named ‘encoderColorFormat’
  143 |         param->encoderColorFormat = EB_YUV422;
      |              ^~
libavcodec/libsvt_hevc.c:143:37: error: ‘EB_YUV422’ undeclared (first use in this function)
  143 |         param->encoderColorFormat = EB_YUV422;
      |                                     ^~~~~~~~~
libavcodec/libsvt_hevc.c:145:14: error: ‘EB_H265_ENC_CONFIGURATION’ {aka ‘struct EB_H265_ENC_CONFIGURATION’} has no member named ‘encoderColorFormat’
  145 |         param->encoderColorFormat = EB_YUV444;
      |              ^~
libavcodec/libsvt_hevc.c:145:37: error: ‘EB_YUV444’ undeclared (first use in this function)
  145 |         param->encoderColorFormat = EB_YUV444;
      |                                     ^~~~~~~~~
libavcodec/libsvt_hevc.c:154:15: error: ‘EB_H265_ENC_CONFIGURATION’ {aka ‘struct EB_H265_ENC_CONFIGURATION’} has no member named ‘encoderColorFormat’
  154 |     if ((param->encoderColorFormat >= EB_YUV422) &&
      |               ^~
libavcodec/libsvt_hevc.c: In function ‘read_in_data’:
libavcodec/libsvt_hevc.c:232:15: error: ‘EB_H265_ENC_CONFIGURATION’ {aka ‘struct EB_H265_ENC_CONFIGURATION’} has no member named ‘encoderColorFormat’
  232 |     if (config->encoderColorFormat == EB_YUV420)
      |               ^~
libavcodec/libsvt_hevc.c:232:39: error: ‘EB_YUV420’ undeclared (first use in this function)
  232 |     if (config->encoderColorFormat == EB_YUV420)
      |                                       ^~~~~~~~~
libavcodec/libsvt_hevc.c:234:20: error: ‘EB_H265_ENC_CONFIGURATION’ {aka ‘struct EB_H265_ENC_CONFIGURATION’} has no member named ‘encoderColorFormat’
  234 |     else if (config->encoderColorFormat == EB_YUV422)
      |                    ^~
libavcodec/libsvt_hevc.c:234:44: error: ‘EB_YUV422’ undeclared (first use in this function)
  234 |     else if (config->encoderColorFormat == EB_YUV422)
      |                                            ^~~~~~~~~
make: *** [ffbuild/common.mak:59: libavcodec/libsvt_hevc.o] Error 1
make: *** Waiting for unfinished jobs....
==> ERROR: A failure occurred in build().
    Aborting...
Finished with result: exit-code
Main processes terminated with: code=exited/status=4
Service runtime: 6min 47.295s

Maybe a version mismatch with the HEVC codec?