Package Details: ffdiaporama 2.1-1

Git Clone URL: https://aur.archlinux.org/ffdiaporama.git (read-only, click to copy)
Package Base: ffdiaporama
Description: Movie creator from photos and video clips
Upstream URL: http://ffdiaporama.tuxfamily.org
Licenses: GPL2
Submitter: boenki
Maintainer: vmp
Last Packager: vmp
Votes: 41
Popularity: 0.007671
First Submitted: 2011-09-14 09:43
Last Updated: 2020-03-26 11:39

Latest Comments

« First ‹ Previous 1 2 3 4 Next › Last »

ricciorama commented on 2014-12-12 20:34

I have the same error.

mr_hangman commented on 2014-10-08 10:33

I am also having the same problem.

Warper4 commented on 2014-10-02 19:15

I have this error in ffdiaporama, and ffdiaporama-devel

engine/_EncodeVideo.cpp:1183:46: aviso: ‘void avcodec_get_frame_defaults(AVFrame*)’ is deprecated (declared at /usr/include/libavcodec/avcodec.h:3555) [-Wdeprecated-declarations]
avcodec_get_frame_defaults(VideoFrame);
^
Makefile:4200: recipe for target '_EncodeVideo.o' failed
make[1]: *** [_EncodeVideo.o] Error 1
make[1]: Leaving directory '/tmp/yaourt-tmp-rafa/aur-ffdiaporama/src/ffDiaporama/src/ffDiaporama'
Makefile:64: recipe for target 'sub-src-ffDiaporama-make_first' failed
make: *** [sub-src-ffDiaporama-make_first] Error 2

rumpelsepp commented on 2014-08-03 16:00

hi.
please rebuild using mkaurball, thanks! :)

boenki commented on 2014-02-14 07:34

@lux: updated to latest version.

LuX commented on 2014-02-13 23:00

Hello!
http://download.tuxfamily.org/ffdiaporama/Archives/ffdiaporama_2.0.1.tar.gz
doesn't exists anymore.

boenki commented on 2013-11-23 22:18

Now it's up-to-date and compiles fine.

boenki commented on 2013-11-18 11:41

I repeat: hi, it currently does not build because ffmpeg is to new (I think)
you can use ffdiaporama-devel, that works.
I will just flag this out-of-date until 2.0 is stable.

hal commented on 2013-11-18 11:06

Hello!

I've got this.

In file included from ../engine/_Diaporama.h:30:0,
from cCustomSlideTable.h:26,
from cCustomSlideTable.cpp:21:
../engine/cBaseMediaFile.h:299:44: error: 'CodecID' has not been declared
virtual int getThreadFlags(CodecID codecId);
^
In file included from ../engine/_Diaporama.h:30:0,
from wgt_QVideoPlayer.h:26,
from wgt_QVideoPlayer.cpp:21:
../engine/cBaseMediaFile.h:299:44: error: 'CodecID' has not been declared
virtual int getThreadFlags(CodecID codecId);
^
In file included from ../engine/_Diaporama.h:30:0,
from mainwindow.h:28,
from main.cpp:29:
../engine/cBaseMediaFile.h:299:44: error: 'CodecID' has not been declared
virtual int getThreadFlags(CodecID codecId);
^
Makefile:2134: recipe for target '../../../build/main.o' failed
make[1]: *** [../../../build/main.o] Error 1
make[1]: *** Waiting for unfinished jobs....
Makefile:2068: recipe for target '../../../build/wgt_QVideoPlayer.o' failed
make[1]: *** [../../../build/wgt_QVideoPlayer.o] Error 1
Makefile:2158: recipe for target '../../../build/cCustomSlideTable.o' failed
make[1]: *** [../../../build/cCustomSlideTable.o] Error 1
Makefile:2111: recipe for target '../../../build/mainwindow.o' failed
make[1]: *** [../../../build/mainwindow.o] Error 1
make[1]: Leaving directory '/tmp/yaourt-tmp-hal/aur-ffdiaporama/src/src/ffDiaporama'
Makefile:39: recipe for target 'sub-src-ffDiaporama-make_default' failed
make: *** [sub-src-ffDiaporama-make_default] Error 2
==> ERROR: A failure occurred in build().

hal commented on 2013-11-18 11:04

Hello!

i'v got this.

In file included from ../engine/_Diaporama.h:30:0,
from cCustomSlideTable.h:26,
from cCustomSlideTable.cpp:21:
../engine/cBaseMediaFile.h:299:44: error: 'CodecID' has not been declared
virtual int getThreadFlags(CodecID codecId);
^
In file included from ../engine/_Diaporama.h:30:0,
from wgt_QVideoPlayer.h:26,
from wgt_QVideoPlayer.cpp:21:
../engine/cBaseMediaFile.h:299:44: error: 'CodecID' has not been declared
virtual int getThreadFlags(CodecID codecId);
^
In file included from ../engine/_Diaporama.h:30:0,
from mainwindow.h:28,
from main.cpp:29:
../engine/cBaseMediaFile.h:299:44: error: 'CodecID' has not been declared
virtual int getThreadFlags(CodecID codecId);
^
Makefile:2134: recipe for target '../../../build/main.o' failed
make[1]: *** [../../../build/main.o] Error 1
make[1]: *** Waiting for unfinished jobs....
Makefile:2068: recipe for target '../../../build/wgt_QVideoPlayer.o' failed
make[1]: *** [../../../build/wgt_QVideoPlayer.o] Error 1
Makefile:2158: recipe for target '../../../build/cCustomSlideTable.o' failed
make[1]: *** [../../../build/cCustomSlideTable.o] Error 1
Makefile:2111: recipe for target '../../../build/mainwindow.o' failed
make[1]: *** [../../../build/mainwindow.o] Error 1
make[1]: Leaving directory '/tmp/yaourt-tmp-hal/aur-ffdiaporama/src/src/ffDiaporama'
Makefile:39: recipe for target 'sub-src-ffDiaporama-make_default' failed
make: *** [sub-src-ffDiaporama-make_default] Error 2
==> ERROR: A failure occurred in build().