Package Details: fclones 0.12.3-1

Git Clone URL: https://aur.archlinux.org/fclones.git (read-only, click to copy)
Package Base: fclones
Description: Efficient Duplicate File Finder
Upstream URL: https://github.com/pkolaczk/fclones
Keywords: duplicate file
Licenses: MIT
Submitter: orhun
Maintainer: orhun
Last Packager: orhun
Votes: 3
Popularity: 0.92
First Submitted: 2020-11-09 00:22
Last Updated: 2021-06-21 23:10

Latest Comments

fryfrog commented on 2021-06-06 03:03

Edit: Looks like this might be related to not getting creation time from ZFS, created issue #55.

Is anyone else getting test failures? My ~ is on zfs, I don't see why it wouldn't be able to read creation times.

test dedupe::test::test_partition_respects_keep_patterns ... FAILED
test dedupe::test::test_partition_respects_drop_patterns ... FAILED
test dedupe::test::test_partition_respects_creation_time_priority ... FAILED
test dedupe::test::test_run_dedupe_script ... FAILED
failures:

---- dedupe::test::test_partition_respects_keep_patterns stdout ----
[2021-06-05 20:02:23.458] fclones-fe24705dd771f261:  warn: Failed to read creation time of file /home/fryfrog/.cache/paru/clone/fclones/src/fclones-0.12.0/target/test/dedupe/partition/keep/file_3: creation time is not available for the filesystem
[2021-06-05 20:02:23.459] fclones-fe24705dd771f261:  warn: Failed to read creation time of file /home/fryfrog/.cache/paru/clone/fclones/src/fclones-0.12.0/target/test/dedupe/partition/keep/file_2: creation time is not available for the filesystem
[2021-06-05 20:02:23.459] fclones-fe24705dd771f261:  warn: Failed to read creation time of file /home/fryfrog/.cache/paru/clone/fclones/src/fclones-0.12.0/target/test/dedupe/partition/keep/file_2: creation time is not available for the filesystem
[2021-06-05 20:02:23.459] fclones-fe24705dd771f261:  warn: Failed to read creation time of file /home/fryfrog/.cache/paru/clone/fclones/src/fclones-0.12.0/target/test/dedupe/partition/keep/file_1: creation time is not available for the filesystem
thread 'dedupe::test::test_partition_respects_keep_patterns' panicked at 'called `Result::unwrap()` on an `Err` value: Error { message: "Could not determine files to drop in group with hash 00000000000000000000000000000000 and len 0: Metadata of some files could not be read." }', src/dedupe.rs:904:68
note: run with `RUST_BACKTRACE=1` environment variable to display a backtrace

---- dedupe::test::test_partition_respects_drop_patterns stdout ----
[2021-06-05 20:02:23.458] fclones-fe24705dd771f261:  warn: Failed to read creation time of file /home/fryfrog/.cache/paru/clone/fclones/src/fclones-0.12.0/target/test/dedupe/partition/drop/file_3: creation time is not available for the filesystem
[2021-06-05 20:02:23.459] fclones-fe24705dd771f261:  warn: Failed to read creation time of file /home/fryfrog/.cache/paru/clone/fclones/src/fclones-0.12.0/target/test/dedupe/partition/drop/file_2: creation time is not available for the filesystem
[2021-06-05 20:02:23.459] fclones-fe24705dd771f261:  warn: Failed to read creation time of file /home/fryfrog/.cache/paru/clone/fclones/src/fclones-0.12.0/target/test/dedupe/partition/drop/file_2: creation time is not available for the filesystem
[2021-06-05 20:02:23.459] fclones-fe24705dd771f261:  warn: Failed to read creation time of file /home/fryfrog/.cache/paru/clone/fclones/src/fclones-0.12.0/target/test/dedupe/partition/drop/file_1: creation time is not available for the filesystem
thread 'dedupe::test::test_partition_respects_drop_patterns' panicked at 'called `Result::unwrap()` on an `Err` value: Error { message: "Could not determine files to drop in group with hash 00000000000000000000000000000000 and len 0: Metadata of some files could not be read." }', src/dedupe.rs:923:68

---- dedupe::test::test_partition_respects_creation_time_priority stdout ----
[2021-06-05 20:02:23.458] fclones-fe24705dd771f261:  warn: Failed to read creation time of file /home/fryfrog/.cache/paru/clone/fclones/src/fclones-0.12.0/target/test/dedupe/partition/ctime_priority/file_3: creation time is not available for the filesystem
[2021-06-05 20:02:23.459] fclones-fe24705dd771f261:  warn: Failed to read creation time of file /home/fryfrog/.cache/paru/clone/fclones/src/fclones-0.12.0/target/test/dedupe/partition/ctime_priority/file_2: creation time is not available for the filesystem
[2021-06-05 20:02:23.459] fclones-fe24705dd771f261:  warn: Failed to read creation time of file /home/fryfrog/.cache/paru/clone/fclones/src/fclones-0.12.0/target/test/dedupe/partition/ctime_priority/file_2: creation time is not available for the filesystem
[2021-06-05 20:02:23.459] fclones-fe24705dd771f261:  warn: Failed to read creation time of file /home/fryfrog/.cache/paru/clone/fclones/src/fclones-0.12.0/target/test/dedupe/partition/ctime_priority/file_1: creation time is not available for the filesystem
thread 'dedupe::test::test_partition_respects_creation_time_priority' panicked at 'called `Result::unwrap()` on an `Err` value: Error { message: "Could not determine files to drop in group with hash 00000000000000000000000000000000 and len 0: Metadata of some files could not be read." }', src/dedupe.rs:856:80

---- dedupe::test::test_run_dedupe_script stdout ----
[2021-06-05 20:02:23.466] fclones-fe24705dd771f261:  warn: Failed to read creation time of file /home/fryfrog/.cache/paru/clone/fclones/src/fclones-0.12.0/target/test/dedupe/partition/dedupe_script/file_3: creation time is not available for the filesystem
[2021-06-05 20:02:23.466] fclones-fe24705dd771f261:  warn: Failed to read creation time of file /home/fryfrog/.cache/paru/clone/fclones/src/fclones-0.12.0/target/test/dedupe/partition/dedupe_script/file_2: creation time is not available for the filesystem
[2021-06-05 20:02:23.466] fclones-fe24705dd771f261:  warn: Failed to read creation time of file /home/fryfrog/.cache/paru/clone/fclones/src/fclones-0.12.0/target/test/dedupe/partition/dedupe_script/file_2: creation time is not available for the filesystem
[2021-06-05 20:02:23.466] fclones-fe24705dd771f261:  warn: Failed to read creation time of file /home/fryfrog/.cache/paru/clone/fclones/src/fclones-0.12.0/target/test/dedupe/partition/dedupe_script/file_1: creation time is not available for the filesystem
[2021-06-05 20:02:23.466] fclones-fe24705dd771f261:  warn: Could not determine files to drop in group with hash 00000000000000000000000000000000 and len 0: Metadata of some files could not be read.
thread 'dedupe::test::test_run_dedupe_script' panicked at 'assertion failed: `(left == right)`
  left: `0`,
 right: `2`', src/dedupe.rs:944:13


failures:
    dedupe::test::test_partition_respects_creation_time_priority
    dedupe::test::test_partition_respects_drop_patterns
    dedupe::test::test_partition_respects_keep_patterns
    dedupe::test::test_run_dedupe_script

test result: FAILED. 92 passed; 4 failed; 0 ignored; 0 measured; 0 filtered out; finished in 65.13s

But humm, it does not have a "Birth" time in stat :|

0 ✓ fryfrog@apollo ~ $ stat /home/fryfrog/.cache/paru/clone/fclones/src/fclones-0.12.0/target/test/dedupe/partition/drop/file_1
  File: /home/fryfrog/.cache/paru/clone/fclones/src/fclones-0.12.0/target/test/dedupe/partition/drop/file_1
  Size: 0               Blocks: 1          IO Block: 131072 regular empty file
Device: 19h/25d Inode: 2938048     Links: 1
Access: (0644/-rw-r--r--)  Uid: ( 1000/ fryfrog)   Gid: ( 1000/ fryfrog)
Access: 2021-06-05 20:02:23.449795401 -0700
Modify: 2021-06-05 20:02:23.449795401 -0700
Change: 2021-06-05 20:02:23.449795401 -0700
 Birth: -