Package Details: falkon-git 3.1.0.72.g2098d69a-1

Git Clone URL: https://aur.archlinux.org/falkon-git.git (read-only)
Package Base: falkon-git
Description: Cross-platform Qt Web Browser
Upstream URL: http://www.qupzilla.com
Licenses: GPL
Conflicts: falkon, qupzilla, qupzilla-qt5, qupzilla-qt5-git
Submitter: SolarAquarion
Maintainer: SolarAquarion
Last Packager: SolarAquarion
Votes: 68
Popularity: 0.026663
First Submitted: 2017-09-06 03:26
Last Updated: 2019-05-27 16:10

Dependencies (19)

Required by (0)

Sources (1)

Latest Comments

1 2 3 4 5 6 ... Next › Last »

sfabius commented on 2019-06-03 14:49

I'm getting the following build fail on multiple machines:

/usr/bin/shiboken2: error while loading shared libraries: libclang.so.7: cannot open shared object file: No such file or directory

make[2]: *** [src/plugins/PyFalkon/CMakeFiles/PyFalkon_autogen.dir/build.make:146: src/plugins/PyFalkon/PyFalkon/pyfalkon_module_wrapper.cpp] Error 127

make[1]: *** [CMakeFiles/Makefile2:1790: src/plugins/PyFalkon/CMakeFiles/PyFalkon_autogen.dir/all] Error 2

make: *** [Makefile:141: all] Error 2

==> ERROR: A failure occurred in build().

Aborting...

Error making: falkon-git

SGOrava commented on 2019-05-27 14:13

Hello, if the python support is enabled in this package I assume that the line

sed -i 's/set(ENABLE_PYTHON_PLUGINS TRUE)//' CMakeLists.txt

is a relic and should be commented or removed in some way. The purpose is to disable python support, which should be enabled by now.

Have a nice day.

muvori commented on 2018-11-03 22:42

you should probably change the upstream url to falkon.org as they ceased development on Qupzilla

elektromodulator commented on 2018-05-31 13:05

Build fails on:

[ 70%] Building CXX object src/plugins/PyFalkon/CMakeFiles/PyFalkon.dir/PyFalkon/pyfalkon_module_wrapper.cpp.o

falkon-git/src/build/src/plugins/PyFalkon/PyFalkon/pyfalkon_module_wrapper.cpp:355:2: error: #error writeMinimalConstructorExpression: Could not find a minimal constructor for type 'QHstsPolicy'. This will result in a compilation error. #error writeMinimalConstructorExpression: Could not find a minimal constructor for type 'QHstsPolicy'. This will result in a compilation error.

keren_sky commented on 2018-05-26 02:26

Hai, could you modify the sources to git+https://anongit.kde.org/falkon.git My sucky ISP recently moved my landliine to a new package & now plain svn:// & git:// clones timeout. All ports blocked. Thnx!

SolarAquarion commented on 2018-05-14 22:05

@jeancf you need to update pyside2 and shiboken

jeancf commented on 2018-05-14 19:48

3.0.0.234.g3760a9ff-1 build fails with this as the most significant event at the 49% mark:

qt.shiboken: (pyfalkon) Can't find typesystem_webenginecore.xml, current path: /tmp/pamac-build-jeancf/falkon-git/src/falkon/src/plugins/PyFalkon, typesystem paths: /usr/share/PySide2/typesystems
Cannot parse file: /tmp/pamac-build-jeancf/falkon-git/src/falkon/src/plugins/PyFalkon/typesystem_pyfalkon.xmlshiboken: Error running ApiExtractor.

zoidberg commented on 2018-04-28 15:49

Edit 2018-04-30: Building works after upstream commit https://phabricator.kde.org/R875:d1fad353d007796e96d9da0b6a17f67afab6bc24

Build exits with following error:

[ 71%] Building CXX object src/plugins/VerticalTabs/CMakeFiles/VerticalTabs.dir/qrc_verticaltabs.cpp.o
Scanning dependencies of target webtabtest
[ 72%] Building CXX object src/plugins/VerticalTabs/CMakeFiles/VerticalTabs.dir/VerticalTabs_autogen/mocs_compilation.cpp.o
[ 72%] Building CXX object autotests/CMakeFiles/webtabtest.dir/webtabtest.cpp.o
[ 72%] Building CXX object src/plugins/PyFalkon/CMakeFiles/PyFalkon.dir/pythonplugin.cpp.o
[ 72%] Building CXX object src/plugins/KDEFrameworksIntegration/CMakeFiles/KDEFrameworksIntegration.dir/ECMQmLoader-falkon_kdeframeworksintegration_qt.cpp.o
In file included from /home/kishore/.cache/pacaur/falkon-git/src/build/src/plugins/PyFalkon/PyFalkon/pyfalkon_python.h:15:0,
                 from /home/kishore/.cache/pacaur/falkon-git/src/falkon/src/plugins/PyFalkon/pythonplugin.cpp:27:
/usr/include/PySide2/QtWebEngineWidgets/pyside2_qtwebenginewidgets_python.h:61:10: fatal error: pyside2_qtwebenginecore_python.h: No such file or directory
 #include <pyside2_qtwebenginecore_python.h>
          ^~~~~~~~~~~~~~~~~~~~~~~~~~~~~~~~~~
compilation terminated.
make[2]: *** [src/plugins/PyFalkon/CMakeFiles/PyFalkon.dir/build.make:311: src/plugins/PyFalkon/CMakeFiles/PyFalkon.dir/pythonplugin.cpp.o] Error 1   
make[1]: *** [CMakeFiles/Makefile2:1808: src/plugins/PyFalkon/CMakeFiles/PyFalkon.dir/all] Error 2
make[1]: *** Waiting for unfinished jobs....
[ 72%] Building CXX object src/plugins/KDEFrameworksIntegration/CMakeFiles/KDEFrameworksIntegration.dir/qrc_kdeframeworksintegration.cpp.o
[ 72%] Building CXX object src/plugins/KDEFrameworksIntegration/CMakeFiles/KDEFrameworksIntegration.dir/KDEFrameworksIntegration_autogen/mocs_compilation.cpp.o
[ 72%] Building CXX object autotests/CMakeFiles/webtabtest.dir/qrc_autotests.cpp.o
[ 72%] Building CXX object autotests/CMakeFiles/webtabtest.dir/webtabtest_autogen/mocs_compilation.cpp.o
[ 73%] Linking CXX shared module ../../../bin/plugins/KDEFrameworksIntegration.so
[ 73%] Linking CXX shared module ../../../bin/plugins/VerticalTabs.so
[ 73%] Built target KDEFrameworksIntegration
[ 73%] Built target VerticalTabs
[ 73%] Linking CXX executable ../bin/webtabtest
[ 73%] Built target webtabtest
make: *** [Makefile:141: all] Error 2
==> ERROR: A failure occurred in build().
    Aborting...

The required header is actually found in /usr/include/PySide2/QtWebEngineCore/pyside2_qtwebenginecore_python.h

pavbaranov commented on 2018-03-02 18:00

After first publish release, PKGBUILD should be reconstructed. The first impression is in: https://github.com/polaur/aur-rebased/tree/master/falkon-git

francoism90 commented on 2017-10-16 18:30

Maybe this as upstream? https://github.com/KDE/falkon