Package Details: eiskaltdcpp-cli 2.4.2-2

Git Clone URL: (read-only, click to copy)
Package Base: eiskaltdcpp
Description: CLI interface for EiskaltDC++ Daemon.
Upstream URL:
Licenses: GPL3
Conflicts: eiskaltdcpp-cli-git
Provides: eiskaltdcpp-cli
Submitter: dhampire
Maintainer: ars
Last Packager: ars
Votes: 15
Popularity: 0.52
First Submitted: 2015-08-11 22:08
Last Updated: 2021-03-04 19:07

Latest Comments

1 2 3 Next › Last »

ars commented on 2021-01-18 17:26

@postcd Removed boost dependencies.

postcd commented on 2021-01-18 12:52

@maintainer despite what other commenter said, the EiskaltDC developer says that "boost" libraries are not needed for EiskaltDC++:

ars commented on 2021-01-13 00:38

v2.4.0 added and now builds against GTK3 and Qt5 instead of GTK2 and Qt4.

deko commented on 2021-01-11 15:18

New version released

iamashwin99 commented on 2019-11-16 16:27

If you get /usr/include/pango-1.0/pango/pango-coverage.h:28:10: fatal error: hb.h: No such file or directory 28 | #include <hb.h> | ^~~~~~ compilation terminated.

a temporary solution is to change /usr/include/pango-1.0/pango/pango-coverage.h and /usr/include/pango-1.0/pango/pango-font.h Where it includes hb.h, it should include harfbuzz/hb.h instead.

raspher commented on 2019-07-14 22:35

"boost" package is required to build this

oi_wtf commented on 2018-07-06 10:15

You should rebuild eiskalt instead of symlinking the library.

A symlink might introduce problems which might silently corrupting something. A rebuild fails if there are problems and therefore is always safer.

aksh1618 commented on 2018-07-05 13:02

I was getting error due to older version og not being available:

eiskaltdcpp-qt: error while loading shared libraries: cannot open shared object file: No such file or directory

So I created a symlink to current version to get it working:

ln -s /usr/lib/ /usr/lib/

kaptoxic commented on 2018-03-02 23:25

I fixed the build not to use local boost libraries; should be fine now.

Skipperio commented on 2018-03-02 20:32

collect2: error: ld returned 1 exit status make[2]: [eiskaltdcpp-gtk/CMakeFiles/eiskaltdcpp-gtk.dir/build.make:931: eiskaltdcpp-gtk/eiskaltdcpp-gtk] Error 1 make[1]: [CMakeFiles/Makefile2:361: eiskaltdcpp-gtk/CMakeFiles/eiskaltdcpp-gtk.dir/all] Error 2 make: *** [Makefile:130: all] Error 2 ==> ERROR: A failure occurred in package_eiskaltdcpp-gtk(). Aborting... :: Unable to build eiskaltdcpp-core - makepkg exited with code: 2