Package Details: efl-git 1.20.99.57388.g7255954ccc-1

Git Clone URL: https://aur.archlinux.org/efl-git.git (read-only)
Package Base: efl-git
Description: Enlightenment Foundation Libraries - Development version
Upstream URL: http://www.enlightenment.org
Licenses: GPL2, custom, BSD, MIT, LGPL2.1
Conflicts: efl, elementary, elementary-git, elementary_test, elementary_test-git, evas_generic_loaders, evas_generic_loaders-git
Provides: efl=1.20.99.57388.g7255954ccc, elementary=1.20.99.57388.g7255954ccc, elementary-git=1.20.99.57388.g7255954ccc, evas_generic_loaders=1.20.99.57388.g7255954ccc
Submitter: Scimmia
Maintainer: raster
Last Packager: raster
Votes: 87
Popularity: 0.004238
First Submitted: 2013-02-15 10:00
Last Updated: 2018-01-26 05:17

Dependencies (44)

Required by (51)

Sources (1)

Latest Comments

1 2 3 4 5 6 ... Next › Last »

raster commented on 2018-04-25 05:28

it should be fixed upstream now btw. i just fixed it.

raster commented on 2018-04-25 05:25

upstream issue for sure. that file was just renamed last night in upstream. it seems someone forgot to update POTFILES.in for a rename that happened.

milkmiruku commented on 2018-04-25 01:39

Currently getting:

  CC       widget_preview_toolbar.o
  CCLD     widget_preview_toolbar
  CC       widget_preview_web.o
  CCLD     widget_preview_web
  CC       widget_preview_win.o
  CCLD     widget_preview_win
  EPB      widget_preview_prefs.epb
Making all in po
make efl.pot-update
make[3]: *** No rule to make target '../src/lib/elementary/efl_ui_layout.c', needed by 'efl.pot-update'.  Stop.
make[2]: *** [Makefile:413: efl.pot] Error 2
make[1]: *** [Makefile:3012: all-recursive] Error 1
make: *** [Makefile:2099: all] Error 2
==> ERROR: A failure occurred in build().

maderios commented on 2018-01-25 17:09

Thanks!

raster commented on 2018-01-25 16:52

fixed. :)

maderios commented on 2018-01-25 16:24

'wayland-client' and 'wayland-scanner' dependencies don't exist. I don't understand... Sorry...

raster commented on 2018-01-25 16:09

what? oh dear. typo went in on edit... fixed.

maderios commented on 2018-01-25 16:07

Hum... error: target not found: wayland-client error: target not found: wayland-scanner ==> ERROR: 'pacman' failed to install missing dependencies.

These packages don't exist!

maderios commented on 2018-01-25 15:53

@raster There's error line 1 #Maintainer

raster commented on 2017-10-03 05:11

hmm. news to me that someone disabled git proto and just simplified to http and ssh. fixed.