Package Details: e-modules-extra-git 20200822-2

Git Clone URL: https://aur.archlinux.org/e-modules-extra-git.git (read-only, click to copy)
Package Base: e-modules-extra-git
Description: Enlightenment modules: Extra unsupported modules in Git not already packaged elsewhere
Upstream URL: http://www.enlightenment.org
Licenses: GPL, MIT
Provides: e-modules-extra
Submitter: Cravix
Maintainer: None
Last Packager: micwoj92
Votes: 45
Popularity: 0.000000
First Submitted: 2013-06-18 10:41
Last Updated: 2020-08-22 17:09

Latest Comments

« First ‹ Previous 1 2 3 4 5 6 7 8 9 10 ... Next › Last »

Cravix commented on 2013-05-21 23:48

@KsenZ:
not really sure about the cause, are you using efl-git?

KsenZ commented on 2013-05-21 07:20

Build error:

make all-recursive
make[1]: Вход в каталог `/tmp/yaourt-tmp-ksenz/aur-e-modules-extra-svn/src/E-MODULES-EXTRA/exebuf'
Making all in src
make[2]: Вход в каталог `/tmp/yaourt-tmp-ksenz/aur-e-modules-extra-svn/src/E-MODULES-EXTRA/exebuf/src'
CC e_mod_main.lo
CC exebuf.lo
exebuf.c: In function 'e_exebuf_show':
exebuf.c:178:4: error: too few arguments to function 'e_popup_layer_set'
e_popup_layer_set(exebuf, 255);
^
In file included from /usr/include/enlightenment/e_includes.h:44:0,
from /usr/include/enlightenment/e.h:272,
from exebuf.c:1:
/usr/include/enlightenment/e_popup.h:48:18: note: declared here
EAPI void e_popup_layer_set(E_Popup *pop, E_Comp_Canvas_Layer comp_layer, E_Layer layer);
^
make[2]: *** [exebuf.lo] Ошибка 1
make[2]: Выход из каталога `/tmp/yaourt-tmp-ksenz/aur-e-modules-extra-svn/src/E-MODULES-EXTRA/exebuf/src'
make[1]: *** [all-recursive] Ошибка 1
make[1]: Выход из каталога `/tmp/yaourt-tmp-ksenz/aur-e-modules-extra-svn/src/E-MODULES-EXTRA/exebuf'
make: *** [all] Ошибка 2
==> ОШИБКА: Произошел сбой в build().
Преждевременный выход...
==> ERROR: Makepkg was unable to build e-modules-extra-svn.

Scimmia commented on 2013-05-16 18:00

@alfa8my, now you update subversion

Anonymous comment on 2013-05-16 14:23

Cannot download from svn:

svn: error while loading shared libraries: libsasl2.so.3: cannot open shared object file: No such file or directory

what now?

AVDuma commented on 2013-05-10 13:29

Updated enlightenment17 (today they have update packages to 0.17.2.1) and reinstalled e-modules-extra-svn : now all is working.
Thanks to all!

AVDuma commented on 2013-05-10 10:12

Thank you Scimmia, I use enlightenment17 (0.17.1), not enlightenment17-git: this means that I can't use e17-places-svn or e-modules-extra-svn?
It is strange because I use the same machine with the same E. I've installed e17-places-svn and it works ok, after the installation, with yaourt, of e-modules-extra-svn, that removes e17-places-svn, I have the error reported before.

Cravix commented on 2013-05-10 09:05

@AVDuma:
fixed the pkgbuild as the comments before shows, just try again :) what i done is stick to rev 84534 to keep compatibility with e17 release.

btw, normally newest e17-places-svn won't work for release, maybe compilation cache leads to such condition, hmm

Cravix commented on 2013-05-10 09:04

@AVDuma:
fixed the pkgbuild as the comments before shows, just try again :) what i done is stick to rev 84534 to keep compatibility with e17 release.

btw, normally your e17-places-svn won't work, maybe compilation cache leads to such condition, hmm

Cravix commented on 2013-05-10 09:00

@AVDuma:
fixed the pkgbuild as the comments before shows, just try again :)

AVDuma commented on 2013-05-10 08:44

Thank you Scimmia, I use enlightenment17 (0.17.1), not enlightenment17-git: this means that I can't use e17-places-svn or e-modules-extra-svn?
It is strange because I use the same machine with the same E. I've installed e17-places-svn and it works ok, after the installation, with yaourt, of e-modules-extra-svn, that removes e17-places-svn, I have the error reported before.