Package Details: dwb-git 2015.07.26.gdda5aa7-1

Git Clone URL: https://aur.archlinux.org/dwb-git.git (read-only, click to copy)
Package Base: dwb-git
Description: A webkit web browser with vi-like keyboard shortcuts
Upstream URL: http://portix.bitbucket.org/dwb
Keywords: browser insecure web webkit
Licenses: GPL
Conflicts: dwb, dwb-gtk3, dwb-gtk3-git, dwb-gtk3-hg, dwb-hg
Provides: dwb
Submitter: Ambrevar
Maintainer: None
Last Packager: Ambrevar
Votes: 24
Popularity: 0.000000
First Submitted: 2015-10-14 14:40
Last Updated: 2015-10-14 14:41

Required by (1)

Sources (1)

Latest Comments

TrialnError commented on 2020-01-11 19:50

Feel free to adopt the package and adjust the PKGBUILD :)

rrt commented on 2019-12-10 07:08

Alright so I fixed this and another [2] compile error and it works! See my two last commits: https://github.com/binarytrails/dwb/commits/master

[2]

scripts/cl_gobject.c: In function ‘gobject_disconnect’:
scripts/cl_gobject.c:488:10: error: non-floating-point argument in call to function ‘__builtin_isnan’
  488 |     if (!isnan(id))
      |          ^~~~~
make[1]: *** [Makefile:45: scripts/cl_gobject.o] Error 1
make[1]: Leaving directory '/home/moi/git/dwb/src'
make: *** [Makefile:17: src.subdir-make] Error 2

rrt commented on 2019-12-10 02:55

make[1]: Leaving directory '/tmp/packerbuild-1000/dwb-git/dwb-git/src/dwb/src/util'
make[1]: Entering directory '/tmp/packerbuild-1000/dwb-git/dwb-git/src/dwb/exar'
cc exar.c
In file included from /usr/include/string.h:494,
                 from exar.c:30:
In function ‘strncpy’,
    inlined from ‘exar_pack’ at exar.c:588:9:
/usr/include/bits/string_fortified.h:106:10: error: ‘__builtin_strncpy’ specified bound 4096 equals destination size [-Werror=stringop-truncation]
  106 |   return __builtin___strncpy_chk (__dest, __src, __len, __bos (__dest));
      |          ^~~~~~~~~~~~~~~~~~~~~~~~~~~~~~~~~~~~~~~~~~~~~~~~~~~~~~~~~~~~~~
cc1: all warnings being treated as errors
make[1]: *** [Makefile:22: exar.o] Error 1
make[1]: Leaving directory '/tmp/packerbuild-1000/dwb-git/dwb-git/src/dwb/exar'
make: *** [Makefile:22: exar.subdir-buildfirst] Error 2
==> ERROR: A failure occurred in build().
    Aborting...
The build failed.

ajb27 commented on 2017-05-21 17:03

Possibly the best Linux-based web browser that exists.

Ambrevar commented on 2016-03-21 22:21

This is a -git package, the pkgver only shows the commit with which the PKGBUILD was created, but makepkg will automatically fetch the latest commit.