Package Details: djv 2.0.8-3

Git Clone URL: https://aur.archlinux.org/djv.git (read-only, click to copy)
Package Base: djv
Description: Professional media review software for VFX, animation, and film production
Upstream URL: http://djv.sourceforge.net/
Licenses: custom
Submitter: N30N
Maintainer: oweissbarth
Last Packager: oweissbarth
Votes: 12
Popularity: 0.000001
First Submitted: 2009-06-17 04:44
Last Updated: 2020-09-30 09:00

Latest Comments

1 2 3 4 5 Next › Last »

Polarity commented on 2021-04-30 06:29

@oweissbarth Thanks for the explanation! I guess I can just wait it out at the moment. :)

oweissbarth commented on 2021-04-29 15:20

@Polarity This is because openexr 3.X is currently not compatible with djv. Archlinux moved to 3.X about a week ago. I'll investigate further. In the meantime you could downgrade to openexr 2.5.X but that might break other applications that were build with the new openexr version.

Polarity commented on 2021-04-28 17:41

Hi! I'm getting stuck when I try to install DJV. Any ideas how I can fix this would be much aprechiated!

CMake Error at CMakeLists.txt:190 (find_package):
  By not providing "FindIlmBase.cmake" in CMAKE_MODULE_PATH this project has
  asked CMake to find a package configuration file provided by "IlmBase", but
  CMake did not find one.

  Could not find a package configuration file provided by "IlmBase" with any
  of the following names:

    IlmBaseConfig.cmake
    ilmbase-config.cmake

  Add the installation prefix of "IlmBase" to CMAKE_PREFIX_PATH or set
  "IlmBase_DIR" to a directory containing one of the above files.  If
  "IlmBase" provides a separate development package or SDK, be sure it has
  been installed.


-- Configuring incomplete, errors occurred!
See also "~/.cache/yay/djv/src/DJV-Release/CMakeFiles/CMakeOutput.log".
See also "~/.cache/yay/djv/src/DJV-Release/CMakeFiles/CMakeError.log".
==> ERROR: A failure occurred in build().
    Aborting...
error making: djv

oweissbarth commented on 2020-09-30 09:02

@bartus I updated the package with your changes. Thanks you for your help. I also learned quite a few things from your changes. So thank you for that as well!

bartus commented on 2020-09-29 21:16

@oweissbarth: I've made some adjustments to this PKGBUILD

They remove tone of redundant dependencies, and refactor some legacy statements. https://github.com/bartoszek/AUR-djv/pull/2

You can merge and signoff with.

git am -s < <(curl -s https://patch-diff.githubusercontent.com/raw/bartoszek/AUR-djv/pull/2.patch)

Feel free to cherry pick anything you like, I've already tested this patch for a few weeks now, without any issues.

oweissbarth commented on 2020-09-28 08:50

@sid350 Can you replace line 26 of the PKGBUILD with "export DJV_BUILD=$srcdir" (without quotes) and try again? Thank you.

sid350 commented on 2020-09-26 21:50

[ 55%] Performing install step for 'IlmBase' [ 17%] Built target Half [ 17%] Built target Iex [ 28%] Built target IexMath [ 75%] Built target IlmThread [100%] Built target Imath Install the project... -- Install configuration: "Release" CMake Error at config/cmake_install.cmake:46 (file): file cannot create directory: /DJV-install/include/OpenEXR. Maybe need administrative privileges. Call Stack (most recent call first): cmake_install.cmake:47 (include)

make[3]: [Makefile:105: install] Error 1 make[2]: [CMakeFiles/IlmBase.dir/build.make:93: IlmBase/src/IlmBase-stamp/IlmBase-install] Error 2 make[1]: [CMakeFiles/Makefile2:360: CMakeFiles/IlmBase.dir/all] Error 2 make: [Makefile:149: all] Error 2 [ 55%] Performing install step for 'IlmBase' [ 17%] Built target Half [ 17%] Built target Iex [ 28%] Built target IexMath [ 75%] Built target IlmThread [100%] Built target Imath Install the project... -- Install configuration: "Release" CMake Error at config/cmake_install.cmake:46 (file): file cannot create directory: /DJV-install/include/OpenEXR. Maybe need administrative privileges. Call Stack (most recent call first): cmake_install.cmake:47 (include)

make[3]: [Makefile:105: install] Error 1 make[2]: [CMakeFiles/IlmBase.dir/build.make:93: IlmBase/src/IlmBase-stamp/IlmBase-install] Error 2 make[1]: [CMakeFiles/Makefile2:360: CMakeFiles/IlmBase.dir/all] Error 2 make: [Makefile:149: all] Error 2 ==> ERROR: A failure occurred in build(). Aborting... error making: djv

kalimerox commented on 2020-06-28 21:30

looks like there are quite some updates recently in this software

net147 commented on 2019-10-23 00:26

@bartus Fixed

bartus commented on 2019-10-22 12:59

Some problem with latest openexr

[ 10%] Building CXX object lib/djvAV/CMakeFiles/djvAV.dir/IFLPlugin.cpp.o                                                                                                 
In file included from /usr/include/OpenEXR/ImfNamespace.h:78,                                                                                                             
                 from /usr/include/OpenEXR/ImfName.h:48,                                                                                                                  
                 from /usr/include/OpenEXR/ImfChannelList.h:47,                                                                                                           
                 from /build/djv/src/djv/lib/djvAV/OpenEXR.h:36,                                                                                                          
                 from /build/djv/src/djv/lib/djvAV/OpenEXRPlugin.h:33,                                                                                                    
                 from /build/djv/src/djv/lib/djvAV/AVContext.cpp:56:  
/build/djv/src/djv/lib/djvAV/OpenEXR.h:103:5: error: missing binary operator before token "("                                                                             
  103 | #if OPENEXR_VERSION_HEX >= 0x02020000                            
      |     ^~~~~~~~~~~~~~~~~~~                                                      
/build/djv/src/djv/lib/djvAV/OpenEXR.h:192:5: error: missing binary operator before token "("                                                                             
  192 | #if OPENEXR_VERSION_HEX >= 0x02020000                          
      |     ^~~~~~~~~~~~~~~~~~~                                                      
/build/djv/src/djv/lib/djvAV/OpenEXR.h:212:5: error: missing binary operator before token "("                                                                             
  212 | #if OPENEXR_VERSION_HEX >= 0x02020000

`OPENEXR_VERSION_HEX is defined in hare

/usr/include/OpenEXR/OpenEXRConfig.h:#define OPENEXR_VERSION_HEX ((uint32_t(OPENEXR_VERSION_MAJOR) << 24) | \