Package Details: darktable-git release.2.5.0.r220.g19407a592-1

Git Clone URL: https://aur.archlinux.org/darktable-git.git (read-only)
Package Base: darktable-git
Description: A virtual lighttable and darkroom for photographers
Upstream URL: http://www.darktable.org/
Licenses: GPL3
Conflicts: darktable
Provides: darktable
Submitter: cousinm
Maintainer: cousinm
Last Packager: cousinm
Votes: 15
Popularity: 0.100765
First Submitted: 2015-08-09 17:40
Last Updated: 2019-01-07 09:22

Latest Comments

1 2 3 4 Next › Last »

cousinm commented on 2019-05-22 14:51

Yes, cannot build with exiv2 0.27 for now.

wilecoyote commented on 2019-05-22 07:04

The build fails with the following error:

Scanning dependencies of target darktable-curve-tool
[ 66%] Building C object CMakeFiles/darktable-curve-tool.dir/darktable-curve-tool.o
[ 66%] Building CXX object CMakeFiles/darktable-curve-tool.dir/exif-wrapper.o
/home/bjoern/.cache/yay/darktable-git/src/darktable/tools/basecurve/exif-wrapper.cpp: In function ‘int exif_get_ascii_datafield(const char*, const char*, char*, size_t)’:
/home/bjoern/.cache/yay/darktable-git/src/darktable/tools/basecurve/exif-wrapper.cpp:62:17: error: ‘Error’ in namespace ‘Exiv2’ does not name a type
   catch (Exiv2::Error& e)
                 ^~~~~
make[2]: *** [CMakeFiles/darktable-curve-tool.dir/build.make:76: CMakeFiles/darktable-curve-tool.dir/exif-wrapper.o] Error 1
make[1]: *** [CMakeFiles/Makefile2:73: CMakeFiles/darktable-curve-tool.dir/all] Error 2
make: *** [Makefile:130: all] Error 2
==> ERROR: A failure occurred in build().
    Aborting...
Error making: darktable-git

costalfy commented on 2018-11-13 20:16

Hi Marc, Of course i would like to help you and archlinux community But i think that i'll need help for my first submission because i have an error 403 when i want to "git push" my modification

cousinm commented on 2018-11-13 15:59

The build number in the PKGBUILD is only updated each time I push a new version of this package (it's not the build number you get when you install it). Or I don't understand what you mean (do you mean I'm not getting the commit value right ?

Anyway, if you want to maintain this package, I would gladly let it to you. I've already got quite a few to manage.

costalfy commented on 2018-11-13 15:05

Hi, I would like to help you to maintain this PKGBUILD. I'm cofounder of https://darktable.fr and we follow the github repository day by day. Actually, the build number in this PKGBUILD doesn't match to the last commit. If i can help you to push modifications don't hesitate to contect me Regards

Meltea commented on 2018-05-09 23:18

https://github.com/darktable-org/darktable/pull/1686 meh, that's all I could have been bothered to do. edit: and it has been merged.

cousinm commented on 2018-05-09 15:05

Hi Rinoceros. It appeared with GCC 8.1. Either you directly do a bugreport to the darktable team as you found it before me, or I can do it, as you want :)

Rhinoceros commented on 2018-05-08 23:34

I'm getting an error with makepkg:

Scanning dependencies of target soften
[ 77%] Building C object src/iop/CMakeFiles/tonecurve.dir/introspection_tonecurve.c.o
[ 77%] Building C object src/iop/CMakeFiles/soften.dir/introspection_soften.c.o
In file included from /tmp/darktable-git/src/darktable/src/iop/tonemap.cc:40,
                 from /tmp/darktable-git/src/darktable/build/src/iop/introspection_tonemap.cc:18:
/tmp/darktable-git/src/darktable/src/bauhaus/bauhaus.h:37:32: error: unnecessary parentheses in declaration of ‘dt_bh_get_type’ [-Werror=parentheses]
 #define DT_BAUHAUS_WIDGET_TYPE (dt_bh_get_type())
                                ^
/tmp/darktable-git/src/darktable/src/bauhaus/bauhaus.h:45:14: note: in expansion of macro ‘DT_BAUHAUS_WIDGET_TYPE’
 extern GType DT_BAUHAUS_WIDGET_TYPE;
              ^~~~~~~~~~~~~~~~~~~~~~
[ 78%] Linking C shared module libsoften.so
cc1plus: all warnings being treated as errors
make[2]: *** [src/iop/CMakeFiles/tonemap.dir/build.make:68: src/iop/CMakeFiles/tonemap.dir/introspection_tonemap.cc.o] Error 1
make[1]: *** [CMakeFiles/Makefile2:5177: src/iop/CMakeFiles/tonemap.dir/all] Error 2
make[1]: *** Waiting for unfinished jobs....
[ 78%] Built target soften
[ 78%] Linking C shared module libtonecurve.so
[ 78%] Built target tonecurve
[ 78%] Linking CXX shared module libdemosaic.so
[ 78%] Built target demosaic
make: *** [Makefile:152: all] Error 2
==> ERROR: A failure occurred in build().
    Aborting...

cousinm commented on 2018-02-10 18:22

Removed -DUSE_GNOME_KEYRING=Off. It must have been useful once upon a time, I don't know. I'm using KDE, so please tell me if that's ok for gnome.

trougnouf commented on 2018-02-10 16:20

This appears to be built without gnome-keyring (-DUSE_GNOME_KEYRING=Off ) but it requires gnome-keyring.

@micdt this is a git version so it's always the latest when you reinstall it.