Package Details: corewars 0.9.13-1

Git Clone URL: (read-only, click to copy)
Package Base: corewars
Description: Simulation game where a number of programs try to crash each other
Upstream URL:
Licenses: GPL2
Submitter: ids1024
Maintainer: ids1024
Last Packager: ids1024
Votes: 1
Popularity: 0.000000
First Submitted: 2016-03-13 18:16
Last Updated: 2016-03-13 18:17

Latest Comments

kleintux commented on 2020-10-17 10:14

fails with

/usr/include/stdint.h:227: note: this is the location of the previous definition
  227 | #  define SIZE_MAX  (18446744073709551615UL)
gcc -DDATADIR="\"/usr/share/corewars\"" -march=x86-64 -mtune=generic -O2 -pipe -fno-plt  -Wl,-O1,--sort-common,--as-needed,-z,relro,-z,now -o corewars  main-gui.o program.o select.o statistic.o pstatistic.o options.o tournament.o dirbrowser.o execute.o preferences.o parser-cw.o lex-cw.o execute-cw.o parser-rc.o lex-rc.o execute-rc.o  -lm  -lgtk-x11-2.0 -lgdk-x11-2.0 -lpangocairo-1.0 -latk-1.0 -lcairo -lgdk_pixbuf-2.0 -lgio-2.0 -lpangoft2-1.0 -lpango-1.0 -lgobject-2.0 -lglib-2.0 -lharfbuzz -lfontconfig -lfreetype 
/usr/bin/ld: parser-rc.o:(.bss+0x448): multiple definition of `current_line'; parser-cw.o:(.bss+0x428): first defined here
/usr/bin/ld: parser-rc.o:(.bss+0x438): multiple definition of `root_line'; parser-cw.o:(.bss+0x420): first defined here
collect2: error: ld returned 1 exit status
make[2]: *** [Makefile:280: corewars] Error 1
make[2]: Leaving directory '/build/corewars/src/corewars-0.9.13/src'
make[1]: *** [Makefile:253: all-recursive] Error 1
make[1]: Leaving directory '/build/corewars/src/corewars-0.9.13'
make: *** [Makefile:191: all] Error 2
==> ERROR: A failure occurred in build().