Package Details: compiz 0.9.14.1-4

Git Clone URL: https://aur.archlinux.org/compiz.git (read-only, click to copy)
Package Base: compiz
Description: Composite manager for Aiglx and Xgl, with plugins and CCSM
Upstream URL: https://launchpad.net/compiz
Licenses: GPL, LGPL, MIT
Conflicts: ccsm, compiz-bcop, compiz-core, compiz-fusion-plugins-experimental, compiz-fusion-plugins-extra, compiz-fusion-plugins-main, compiz-gtk, compizconfig-python, libcompizconfig, simple-ccsm
Provides: ccsm=0.9.14.1, compiz-bcop=0.9.14.1, compiz-core=0.9.14.1, compiz-plugins-extra=0.9.14.1, compiz-plugins-main=0.9.14.1, compizconfig-python=0.9.14.1, libcompizconfig=0.9.14.1
Submitter: Chazza
Maintainer: Ta180m
Last Packager: Chazza
Votes: 160
Popularity: 0.93
First Submitted: 2014-08-04 13:22
Last Updated: 2020-10-23 12:45

Required by (28)

Sources (8)

Latest Comments

« First ‹ Previous 1 2 3 4 5 6 7 8 9 10 11 ... Next › Last »

piotrv commented on 2020-08-16 17:09

@Chazza I downloaded the snapshot; tried to build it from the PKGBUILD file: exactly the same issue. Might it be related to the intltool package, looking at "warning: header field 'Language' missing in header" for all po files ?

robson commented on 2020-08-16 10:32

I just finished building compiz, and it builds fine. I suggest you download the snapshot, unpack it, and go to the compiz directory and run a terminal in it and run makepkg -sirc. And here is the compiz package built. https://i.postimg.cc/wBMnNFTL/Przechwycenie-obrazu-ekranu-2020-08-16-12-25-35.png

piotrv commented on 2020-08-16 09:23

@Chazza I cloned the pkg from git , but unfortunately get same issue when building with makepkg, so it seems not yay related . .

Chazza commented on 2020-08-16 08:38

@firemage78 @piotrv You both have the same problem but I can't reproduce it at all. I notice you are both building in ~/.cache/yay. Presumably this is the build directory of some AUR helper. Do you still get the error if you just build with makepkg?

firemage78 commented on 2020-08-16 05:40

Unable to complete build due to error:

Scanning dependencies of target compiz_gsettings_schema [ 11%] Generating ../generated/glib-2.0/schemas/org.compiz.core.gschema.xml /home/joe/.cache/yay/compiz/src/compiz-0.9.14.1/po/hi.po:7: warning: header field 'Language' missing in header /home/joe/.cache/yay/compiz/src/compiz-0.9.14.1/build/generated/core.xml:145: parser error : Couldn't find end of Start Tag sho line 145 <sho ^ /home/joe/.cache/yay/compiz/src/compiz-0.9.14.1/build/generated/core.xml:145: parser error : EndTag: '</' not found <sho ^ unable to parse /home/joe/.cache/yay/compiz/src/compiz-0.9.14.1/build/generated/core.xml make[2]: [metadata/CMakeFiles/compiz_gsettings_schema.dir/build.make:80: generated/glib-2.0/schemas/org.compiz.core.gschema.xml] Error 6 make[1]: [CMakeFiles/Makefile2:7543: metadata/CMakeFiles/compiz_gsettings_schema.dir/all] Error 2 make[1]: *** Waiting for unfinished jobs....

............

[ 16%] Generating zh_TW/LC_MESSAGES/compiz.mo [ 16%] Generating zu/LC_MESSAGES/compiz.mo /home/joe/.cache/yay/compiz/src/compiz-0.9.14.1/po/uk.po:7: warning: header field 'Project-Id-Version' still has the initial default value /home/joe/.cache/yay/compiz/src/compiz-0.9.14.1/po/uk.po:7: warning: header field 'Language-Team' still has the initial default value /home/joe/.cache/yay/compiz/src/compiz-0.9.14.1/po/uk.po:7: warning: header field 'Language' missing in header /home/joe/.cache/yay/compiz/src/compiz-0.9.14.1/po/zh_CN.po:7: warning: header field 'Language' missing in header /home/joe/.cache/yay/compiz/src/compiz-0.9.14.1/po/zu.po:5: warning: header field 'Language' missing in header /home/joe/.cache/yay/compiz/src/compiz-0.9.14.1/po/zh_TW.po:7: warning: header field 'Language' missing in header [ 16%] Built target nls make: *** [Makefile:182: all] Error 2 ==> ERROR: A failure occurred in build(). Aborting... error making: %!s(func() string=0x55b0a1aa7bb0)

Chazza commented on 2020-08-15 17:35

@piotrv I'm unable to reproduce that build failure. Sorry.

piotrv commented on 2020-08-15 13:09

compilation failure:

CREATED ~/.cache/yay/compiz/src/compiz-0.9.14.1/build/generated/workspacenames.xml
[  7%] Generating ../../generated/glib-2.0/schemas/org.compiz.workspacenames.gschema.xml
[  8%] Linking CXX static library libcompiz_timer.a
[  8%] Built target workspacenames_gsettings_schema
~/.cache/yay/compiz/src/compiz-0.9.14.1/po/as.po:7: warning: header field 'Project-Id-Version' still has the initial default value
~/.cache/yay/compiz/src/compiz-0.9.14.1/po/as.po:7: warning: header field 'Last-Translator' still has the initial default value
~/.cache/yay/compiz/src/compiz-0.9.14.1/po/as.po:7: warning: header field 'Language-Team' still has the initial default value
~/.cache/yay/compiz/src/compiz-0.9.14.1/po/as.po:7: warning: header field 'Language' missing in header
[  8%] Generating ast/LC_MESSAGES/compiz.mo
[  8%] Generating az/LC_MESSAGES/compiz.mo

. . . . .

~/.cache/yay/compiz/src/compiz-0.9.14.1/po/zu.po:5: warning: header field 'Language' missing in header
[ 16%] Linking CXX static library libcompiz_string.a
[ 16%] Built target compiz_string
[ 16%] Built target nls
make: *** [Makefile:183: all] Error 2
==> ERROR: A failure occurred in build().
    Aborting...
error making: %!s(func() string=0x5582c44d2830)

Chazza commented on 2020-06-26 14:15

@corsaw intltool depends on perl-xml-parser so this should already be installed on your system. I cannot reproduce the problem on my side so I'm pretty sure this is not an issue with the compiz PKGBUILD. I suggest you check that your system is up to date.

robson commented on 2020-06-26 13:53

@corsaw For me, DE Xfce compiz builds correctly. All I can offer you is to add the chaotic-aur repo and install compiz-git.

warigan commented on 2020-06-26 13:10

Unable to build because of a missing perl moduel (XML::Parser). It works after installing it with cpan.

Scanning dependencies of target compiz-gnome-keybindings
[  3%] Generating 50-compiz-navigation.xml
Merging translations into /home/oscar/aur/compiz/src/compiz-0.9.14.1/build/gtk/gnome/50-compiz-navigation.xml.
You must have XML::Parser installed to run /usr/bin/intltool-merge

make[2]: *** [gtk/gnome/CMakeFiles/compiz-gnome-keybindings.dir/build.make:82: gtk/gnome/50-compiz-navigation.xml] Error 2
make[2]: *** Deleting file 'gtk/gnome/50-compiz-navigation.xml'
make[1]: *** [CMakeFiles/Makefile2:5006: gtk/gnome/CMakeFiles/compiz-gnome-keybindings.dir/all] Error 2
make: *** [Makefile:183: all] Error 2
==> ERROR: A failure occurred in build().
Aborting...