Package Details: clementine-git 1.4.0rc1.r329.gf7bece3b8.0.gf7bece3b8-1

Git Clone URL: (read-only, click to copy)
Package Base: clementine-git
Description: A modern music player and library organizer
Upstream URL:
Licenses: GPL
Conflicts: clementine
Provides: clementine
Submitter: swiftscythe
Maintainer: zanny
Last Packager: zanny
Votes: 85
Popularity: 0.006329
First Submitted: 2011-07-19 22:38
Last Updated: 2020-09-18 06:40

Dependencies (14)

Required by (1)

Sources (1)

Latest Comments

« First ‹ Previous 1 2 3 4 5 6 7 8 ... Next › Last »

j605 commented on 2016-11-27 09:40

Can you remove libechonest from dependency list as upstream has removed it.

xiong.chiamiov commented on 2016-02-29 23:22

1.3 RC shouldn't matter, since this package builds from git HEAD. The version number is autogenerated from git-describe.

varlesh commented on 2016-02-06 21:11

1.3 RC version?

NOTtheMessiah commented on 2016-01-16 09:01

I'm getting issues when I try to compile with protobuf3:

../libclementine-tagreader/liblibclementine-tagreader.a(tagreader.cpp.o):tagreader.cpp:(.text+0x3861): more undefined references to `google::protobuf::internal::empty_string_[abi:cxx11]' follow
collect2: error: ld returned 1 exit status
ext/clementine-tagreader/CMakeFiles/clementine-tagreader.dir/build.make:159: recipe for target 'clementine-tagreader' failed
make[2]: *** [clementine-tagreader] Error 1
CMakeFiles/Makefile2:2293: recipe for target 'ext/clementine-tagreader/CMakeFiles/clementine-tagreader.dir/all' failed
make[1]: *** [ext/clementine-tagreader/CMakeFiles/clementine-tagreader.dir/all] Error 2
Makefile:127: recipe for target 'all' failed
make: *** [all] Error 2

xiong.chiamiov commented on 2015-12-17 17:33

To get this working with Spotify, I had to pull the protobuf PKGBUILD out of ABS and add options=('staticlibs') to prevent it from stripping the static library that clementine wants.

Chocobozzz commented on 2015-05-05 10:18

The hack is not needed anymore, fixed in the master branch ( :)

swiftscythe commented on 2015-04-29 19:27

Updated, thanks :)

post-factum commented on 2015-04-29 18:32

Consider adding the following command to PKGBUILD (before calling make) to fix crypto++ issue:

sed -i 's/crypto++/cryptopp/g' ${srcdir}/Clementine/src/internet/spotify/spotifyblobdownloader.cpp

ryuzy commented on 2015-04-29 08:24

I think in src/internet/spotify/spotifyblobdownloader.cpp
#include <crypto++/pkcspad.h>
#include <crypto++/rsa.h>

Should be edited to:
#include <cryptopp/pkcspad.h>
#include <cryptopp/rsa.h>

ryuzy commented on 2015-04-29 08:17

I'm receiving this error:
/tmp/yaourt-tmp-ryuzaki/aur-clementine-git/src/Clementine/src/internet/spotify/spotifyblobdownloader.cpp:42:30: fatal error: crypto++/pkcspad.h: No such file or directory
#include <crypto++/pkcspad.h>
compilation terminated.
src/CMakeFiles/clementine_lib.dir/build.make:11347: recipe for target 'src/CMakeFiles/clementine_lib.dir/internet/spotify/spotifyblobdownloader.cpp.o' failed
make[2]: *** [src/CMakeFiles/clementine_lib.dir/internet/spotify/spotifyblobdownloader.cpp.o] Error 1

Am I the only one?