Package Details: chatty 0.13-1

Git Clone URL: https://aur.archlinux.org/chatty.git (read-only, click to copy)
Package Base: chatty
Description: Twitch Chat Client for Desktop
Upstream URL: https://chatty.github.io/
Licenses: GPL3
Submitter: c-korn
Maintainer: Freso
Last Packager: Freso
Votes: 27
Popularity: 0.012024
First Submitted: 2015-03-23 00:17
Last Updated: 2020-10-25 20:05

Required by (0)

Sources (4)

Pinned Comments

Freso commented on 2018-07-15 16:02

For users who have used this PKGBUILD on version earlier than 0.9.x, note that from PKGBUILD 0.9.1-1 onwards, the PKGBUILD will not include as many patches as <0.9 PKGBUILDs did. One of the things this means is that the configuration will now be read from $HOME/.chatty instead of $HOME/.config/chatty. I'd recommend to either create a symlink (cd $HOME && ln -s .config/chatty .chatty) or move (or copy) the directory (cd $HOME && mv .config/chatty .chatty) prior to running version 0.9.x+ the first time.

Latest Comments

1 2 3 Next › Last »

ghost_order59 commented on 2020-08-02 13:55

I'm not sure where I should post this since it involves Awesome WM but...

Using Awesome WM I'm trying to make Chatty always with start in a specific position and size. The position parameters are working as intended, but Chatty doesn't care about the W and H dimensions, it always start with the last dimensions bypassing the ones I putted in the rc.lua

PD: One weird thing is that every time I'm changing the window size it also moves, always in a bottom right direction. This is annoying but not a problem, I'm mentioning this just in case it is related to the possible issue.

Freso commented on 2020-04-27 14:44

java-environment is already a make dependency and it is theoretically possible to build and run the package with a different JDK than OpenJDK 8 (though admittedly I haven’t tried). If you fail to install and/or run it with OpenJDK 10 or 11 or Oracle’s JDK (currently 14), please submit bug reports to upstream. (Note that this is in accordance with https://wiki.archlinux.org/index.php/Java_package_guidelines#Dependencies and what upstream themselves specify ("It runs on […] Java 8 or later.").)

TheJackiMonster commented on 2020-04-23 18:19

Please add 'jdk8-openjdk' as make-dependency to make installation easier.

TheFrenchGhosty commented on 2020-01-27 21:30

jdk8-openjdk is an explicit make dependency and needs to be installed

@troyBORG That's how to fix your problem

troyBORG commented on 2019-12-27 18:15

-> Extracting chatty-0.10.tar.gz with bsdtar ==> Starting prepare()... patching file src/chatty/Chatty.java ==> Sources are ready. ==> Making package: chatty 0.10-1 (Fri 27 Dec 2019 12:13:36 PM CST) ==> Checking runtime dependencies... ==> Checking buildtime dependencies... ==> WARNING: Using existing $srcdir/ tree ==> Removing existing $pkgdir/ directory... ==> Starting build()...

FAILURE: Build failed with an exception.

  • What went wrong: Execution failed for task ':compileJava'.

    Could not find tools.jar. Please check that /usr/lib/jvm/java-8-openjdk/jre contains a valid JDK installation.

  • Try: Run with --stacktrace option to get the stack trace. Run with --info or --debug option to get more log output. Run with --scan to get full insights.

  • Get more help at https://help.gradle.org

BUILD FAILED in 1s ==> ERROR: A failure occurred in build(). Aborting... checking dependencies...

Packages (1) gradle-6.0.1-1

Total Removed Size: 103.31 MiB

mheob commented on 2019-10-25 04:31

@Freso Please commit this patch to update to the current chatty version 0.10:

https://gist.github.com/mheob/0da42f55d11a55599388f62d7580386c#file-0001-chatty-0-10-1-patch

CowboiMatt commented on 2019-10-10 02:37

Just a caution, this doesn't work with the current "jdk-openjdk" package (Java 13). If you install this package when prompted, you will get the following error: = = = = = FAILURE: Build failed with an exception.

  • What went wrong: A problem occurred configuring root project 'chatty-0.9.7'.

    Could not open cp_proj remapped class cache for 4w7y4hmqg9c0tc36ade1cyejo (/home/matt/.gradle/caches/5.6. Could not open cp_proj generic class cache for build file '/home/matt/aur/chatty/src/chatty-0.9.7/buil > BUG! exception in phase 'semantic analysis' in source unit 'BuildScript' Unsupported class file m = = = = = I uninstalled that package, and instead chose the LTS java version "jdk11-openjdk" and this successfully installed without issue.

bennyhillthebes commented on 2018-07-20 10:39

@Freso thank you for the explanation.

Freso commented on 2018-07-18 19:30

There is now also a chatty-beta package for those who want to be bleeding bleeding edge: https://aur.archlinux.org/packages/chatty-beta

Freso commented on 2018-07-18 18:31

@bennyhillthebes gradle is needed to build the .jar file. This package actually builds chatty from its source, it doesn't just ship the precompiled source that upstream makes available (this would have been a binary package, recognised by the '-bin' suffix in the package name).