Package Details: c-lightning-git r5960.fa1c8b36-1

Git Clone URL: (read-only, click to copy)
Package Base: c-lightning-git
Description: A Lightning Network implementation in C
Upstream URL:
Licenses: custom
Submitter: tensor5
Maintainer: tensor5
Last Packager: tensor5
Votes: 1
Popularity: 0.000000
First Submitted: 2017-06-04 14:25
Last Updated: 2019-06-30 05:44

Latest Comments

tensor5 commented on 2019-06-30 05:45

@pizzaman, thanks for reporting, try now.

pizzaman commented on 2019-06-23 05:37

==> Starting prepare()...
Submodule 'daemon/jsmn' ( registered for path 'external/jsmn'
Submodule 'external/libbacktrace' ( registered for path 'external/libbacktrace'
error: pathspec 'external/libbase58' did not match any file(s) known to git
==> ERROR: A failure occurred in prepare().
:: Unable to build c-lightning-git - makepkg exited with code: 4

tensor5 commented on 2018-02-06 12:12

@matiwinnetou, it should work now.

matiwinnetou commented on 2018-01-26 18:32

Wmissing-prototypes -Wold-style-definition -Wmissing-format-attribute -Wcast-qual  -DBINTOPKGLIBEXECDIR='"'../libexec/c-lightning'"' -Wall -Wundef -Wmissing-prototypes -Wmissing-declarations -Wstrict-prototypes -Wold-style-definition -std=gnu11 -g -fstack-protector -I ccan -I external/libsodium/src/libsodium/include -I external/libwally-core/include/ -I external/libwally-core/src/secp256k1/include/ -I external/jsmn/ -I external/libbase58/ -I external/libbacktrace -I . -I/usr/local/include   -DDEVELOPER=1 -DCCAN_TAL_DEBUG=1 -DCCAN_TAKE_DEBUG=1 -DSHACHAIN_BITS=48 -DJSMN_PARENT_LINKS -c -o atomic.lo ../libbacktrace/atomic.c
./libtool: line 496: CDPATH: command not found
libtool: Version mismatch error.  This is libtool 2.2.4, but the
libtool: definition of this LT_INIT comes from an older release.
libtool: You should recreate aclocal.m4 with macros from libtool 2.2.4
libtool: and run autoconf again.
make[2]: *** [Makefile:472: atomic.lo] Error 63
make[2]: Leaving directory '/tmp/yaourt-tmp-mati/aur-c-lightning-git/src/lightning/external/libbacktrace-build'
make[1]: *** [Makefile:354: all] Error 2
make[1]: Leaving directory '/tmp/yaourt-tmp-mati/aur-c-lightning-git/src/lightning/external/libbacktrace-build'
make: *** [external/Makefile:80: external/libbacktrace.a] Error 2
rm external/libwally-core/src/secp256k1/
==> ERROR: A failure occurred in build().

daurnimator commented on 2017-12-29 14:38

Compilation fails with:

external/libsodium.a(libsodium_la-randombytes.o):/home/daurnimator/.cache/aursync/c-lightning-git/src/lightning/external/libsodium/src/libsodium/randombytes/randombytes.c:28: undefined reference to `randombytes_sysrandom_implementation'
collect2: error: ld returned 1 exit status
make: *** [Makefile:258: lightningd/lightning_hsmd] Error 1
rm external/libwally-core/src/secp256k1/