Package Details: brackets 1.14.1-2

Git Clone URL: (read-only, click to copy)
Package Base: brackets
Description: An open source code editor for the web, written in JavaScript, HTML and CSS.
Upstream URL:
Licenses: MIT
Conflicts: brackets-bin, brackets-git
Submitter: 4javier
Maintainer: petronny
Last Packager: petronny
Votes: 104
Popularity: 0.95
First Submitted: 2013-12-05 11:44
Last Updated: 2020-02-05 04:44

Required by (0)

Sources (13)

Pinned Comments

petronny commented on 2017-11-24 05:10

Prebuilt binaries of this package can be found in arch4edu.

Latest Comments

1 2 3 4 5 6 ... Next › Last »

petronny commented on 2020-06-14 06:38

@TheGoliath version 1.14.2 is not for linux.

Brackets 1.14.2 is here! This release is targeted for Mac and Windows users only.

Musikolo commented on 2019-05-05 05:06

@petronny, I don't code in PHP, so I don't need it. Best approach could be to add it as an optional dependency (optdepends section) for PHP support. However, I cannot imagine anybody coding in PHP language without the php package installed.

petronny commented on 2019-05-05 04:48

@Musikolo Is the PHP support still working after force removing?

Musikolo commented on 2019-05-05 00:57

@petronny, I think composer and php packages should only be required for building brackets. So, they should be moved to the makedepends section. I forced removing those, and brackets works the same for me.


slav commented on 2019-05-04 16:55

Brackets v.1.14-2 resolved issue. Thank you for quick response.

Musikolo commented on 2019-05-04 02:01

I'm getting the same error:

slav commented on 2019-05-03 18:33

Unfortunately come error on the end of compilation...

sh: composer: command not found

npm WARN php-Tooling@1.0.0 No repository field. npm WARN php-Tooling@1.0.0 No license field. npm ERR! Linux 5.0.10-arch1-1-ARCH npm ERR! argv "/usr/bin/node" "/tmp/packerbuild-1000/brackets/brackets/src/brackets/node_modules/.bin/npm" "install" "--production" npm ERR! node v11.14.0 npm ERR! npm v3.10.10 npm ERR! file sh npm ERR! code ELIFECYCLE npm ERR! errno ENOENT npm ERR! syscall spawn npm ERR! php-Tooling@1.0.0 postinstall: composer require felixfbecker/language-server && composer run-script --working-dir=vendor/felixfbecker/language-server parse-stubs npm ERR! spawn ENOENT npm ERR! npm ERR! Failed at the php-Tooling@1.0.0 postinstall script 'composer require felixfbecker/language-server && composer run-script --working-dir=vendor/felixfbecker/language-server parse-stubs'. npm ERR! Make sure you have the latest version of node.js and npm installed. npm ERR! If you do, this is most likely a problem with the php-Tooling package, npm ERR! not with npm itself. npm ERR! Tell the author that this fails on your system: npm ERR! composer require felixfbecker/language-server && composer run-script --working-dir=vendor/felixfbecker/language-server parse-stubs npm ERR! You can get information on how to open an issue for this project with: npm ERR! npm bugs php-Tooling npm ERR! Or if that isn't available, you can get their info via: npm ERR! npm owner ls php-Tooling npm ERR! There is likely additional logging output above.

npm ERR! Please include the following file with any support request: npm ERR! /tmp/packerbuild-1000/brackets/brackets/src/brackets/src/extensions/default/PhpTooling/npm-debug.log Warning: Task "npm-install-extensions" failed. Use --force to continue.

Aborted due to warnings. npm ERR! code ELIFECYCLE npm ERR! errno 3 npm ERR! Brackets@1.14.0-0 postinstall: grunt install npm ERR! Exit status 3 npm ERR! npm ERR! Failed at the Brackets@1.14.0-0 postinstall script. npm ERR! This is probably not a problem with npm. There is likely additional logging output above.

npm ERR! A complete log of this run can be found in: npm ERR! /home/slaw/.npm/_logs/2019-05-03T16_44_38_628Z-debug.log ==> ERROR: A failure occurred in build(). Aborting... The build failed. local database is up to date

petronny commented on 2019-05-03 05:46

I've upgraded this to 1.14 with the way I built 1.13. The vanilla 1.14 still raises a segment fault when launched.

You may need to run

echo '[position]' > ~/.config/Brackets/window.ini

after upgraded.

This version may not have php support as the vanilla 1.14 .

petronny commented on 2019-04-19 20:17

I finally get this working. Here is what I've done:

  1. Switching the icu built by Adobe to the system icu. No need to install gcc5 now.
  2. Using brackets-shell v1.12 since it's working.
  3. Applying #648 (This maybe optional.)
  4. Copying /opt/brackets/Brackets from the deb binary.

I don't want to do more with v1.13 since v1.14 is almost out. May we get good luck with v1.14.

The prebuilt version has been uploaded to arch4edu.

Cristophero commented on 2018-11-02 01:05

Brackets 1.12 live preview...