Package Details: bluez-utils-compat 5.50-6.2

Git Clone URL: https://aur.archlinux.org/bluez-utils-compat.git (read-only)
Package Base: bluez-utils-compat
Description: Development and debugging utilities for the bluetooth protocol stack. Includes deprecated tools.
Upstream URL: http://www.bluez.org/
Keywords: hciconfig hcidump hcitool
Licenses: GPL2
Conflicts: bluez-hcidump, bluez-hcitool, bluez-utils
Provides: bluez-hcidump, bluez-hcitool, bluez-utils
Replaces: bluez<=4.101, bluez-hcidump
Submitter: thurstylark
Maintainer: twa022
Last Packager: twa022
Votes: 24
Popularity: 0.558891
First Submitted: 2017-03-02 17:34
Last Updated: 2019-07-13 13:25

Required by (31)

Sources (4)

Latest Comments

« First ‹ Previous 1 2 3 4 5

NicolasV commented on 2017-05-10 11:23

Same error, here is the full trace:
[...]
PASS: unit/test-textfile
PASS: unit/test-ecc
PASS: unit/test-avctp
PASS: unit/test-gobex-transfer
PASS: unit/test-avdtp
PASS: unit/test-avrcp
./test-driver: line 107: 19399 Segmentation fault (core dumped) "$@" > $log_file 2>&1
FAIL: unit/test-gatt
make --no-print-directory all-am
============================================================================
Testsuite summary for bluez 5.45
============================================================================
# TOTAL: 25
# PASS: 24
# SKIP: 0
# XFAIL: 0
# FAIL: 1
# XPASS: 0
# ERROR: 0
============================================================================
See ./test-suite.log
============================================================================
make[3]: *** [Makefile:8493: test-suite.log] Error 1
make[2]: *** [Makefile:8601: check-TESTS] Error 2
make[1]: *** [Makefile:8985: check-am] Error 2
make: *** [Makefile:8987: check] Error 2
==> ERROR: A failure occurred in check().
Aborting...
==> ERROR: Makepkg was unable to build bluez-utils-compat.
==> Restart building bluez-utils-compat ? [y/N]
==> -------------------------------------------
==>

framas commented on 2017-05-10 10:18

I've tested it with makechrootpkg in an clean enviroment. Does also not work

CCLD unit/test-gatt
./test-driver: line 107: 9621 Segmentation fault (core dumped) "$@" > $log_file 2>&1
FAIL: unit/test-gatt
make --no-print-directory all-am
make[5]: Nothing to be done for 'all-am'.
============================================================================
Testsuite summary for bluez 5.45
============================================================================
# TOTAL: 25
# PASS: 24
# SKIP: 0
# XFAIL: 0
# FAIL: 1
# XPASS: 0
# ERROR: 0
============================================================================
See ./test-suite.log
============================================================================
make[3]: *** [Makefile:8493: test-suite.log] Error 1
make[2]: *** [Makefile:8601: check-TESTS] Error 2
make[1]: *** [Makefile:8985: check-am] Error 2
make: *** [Makefile:8987: check] Error 2
==> ERROR: A failure occurred in check().
Aborting...
==> ERROR: Build failed, check /tmp/copy/build

thurstylark commented on 2017-05-09 17:37

I wasn't suggesting setting LANG=C as a fix, I suggested it so the output would be in English.

https://wiki.archlinux.org/index.php/DeveloperWiki:Building_in_a_Clean_Chroot

NicolasV commented on 2017-05-09 14:11

On May 5th I sucessfully upgraded this package on my laptop. I just can't upgrade on my main PC.
I also tried setting "LANG=C" while calling "yaourt -Syua" but luck.
Is there a simple method to build in a clean chroot?

thurstylark commented on 2017-05-09 13:07

@nicolasvila Can you try the build again with LANG=C?

Also, have you tried building in a clean chroot?

NicolasV commented on 2017-05-09 07:22

Latest version 5.45-1 crash during unit test:

[...]
PASS: unit/test-eir
PASS: unit/test-uuid
PASS: unit/test-textfile
PASS: unit/test-avctp
PASS: unit/test-avdtp
PASS: unit/test-gobex-transfer
PASS: unit/test-avrcp
./test-driver : ligne 107 : 9008 Erreur de segmentation (core dumped)"$@" > $log_file 2>&1
FAIL: unit/test-gatt
make --no-print-directory all-am
============================================================================
Testsuite summary for bluez 5.45
============================================================================
# TOTAL: 25
# PASS: 24
# SKIP: 0
# XFAIL: 0
# FAIL: 1
# XPASS: 0
# ERROR: 0
============================================================================
See ./test-suite.log
============================================================================
make[3]: *** [Makefile:8493: test-suite.log] Error 1
make[2]: *** [Makefile:8601: check-TESTS] Error 2
make[1]: *** [Makefile:8985: check-am] Error 2
make: *** [Makefile:8987: check] Error 2
==> ERREUR : Une erreur s’est produite dans check().
Abandon...
==> ERREUR : Makepkg n'a pas pu construire bluez-utils-compat.
==> Relancer la compilation de bluez-utils-compat ? [o/N]
==> -----------------------------------------------------
==>
==> ERREUR : impossible de mettre à jour

thurstylark commented on 2017-04-25 15:44

Builds in a clean chroot just fine for me.

naraesk commented on 2017-04-20 16:44

valid pgp keys needs an update!

parkerlreed commented on 2017-03-22 18:44

All of this stuff getting deprecated (hcitool, hciconfig, gatttool) but what are the replacements? (short of installing this package)