Package Details: blender-git 2.81.r91063.ab519b91b2c-1

Git Clone URL: https://aur.archlinux.org/blender-git.git (read-only, click to copy)
Package Base: blender-git
Description: A fully integrated 3D graphics creation suite (development)
Upstream URL: http://blender.org/
Licenses: GPL
Conflicts: blender
Provides: blender
Submitter: stativ
Maintainer: fbrennan (kureta)
Last Packager: kureta
Votes: 71
Popularity: 0.000160
First Submitted: 2013-12-05 10:11
Last Updated: 2019-12-04 14:38

Dependencies (28)

Required by (53)

Sources (6)

Latest Comments

« First ‹ Previous ... 4 5 6 7 8 9 10 11 12 13 14 ... Next › Last »

mrunion commented on 2013-05-09 00:30

I removed all the sources and rebuilt and it's fine. It's NOT using OPENJPEG by default I think. (But it looks like it is from the linux-config.py -- so maybe some kind of library checker is failing. If it's using the info from linux-config.py, then the include and lib folders are wrong.). I'm getting too old for this I think!

mrunion commented on 2013-05-09 00:27

I removed all the sources and rebuilt and it's fine. It's NOT using OPENJPEG by default I think (but it looks like it is from the linux-config.py). I' getting too old for this I think!

mrunion commented on 2013-05-09 00:00

Also, did you know in the source code there is a PKGBUILD for Arch in the /build_files/package_spec/pacman folder? Cool!

mrunion commented on 2013-05-08 23:50

Anyone else get this:

/var/abs/local/blender-svn/src/blender/source/blender/imbuf/intern/jp2.c:42:22: fatal error: openjpeg.h: No such file or directory
#include "openjpeg.h"

I'm not enlightened enough at present to know how to check where Blender is looking for it's includes.

mrunion commented on 2013-04-18 02:19

Sorry, me again. Does anyone else get this error on compiling:

Linking CXX executable ../../bin/blender
../../lib/libextern_libmv.a(libmv-capi.cpp.o): In function `libmv_solveModal':
libmv-capi.cpp:(.text+0x1490): undefined reference to `libmv::ModalSolver(libmv::Tracks const&, libmv::EuclideanReconstruction*, libmv::ProgressUpdateCallback*)'
collect2: error: ld returned 1 exit status
make[2]: *** [bin/blender] Error 1
make[1]: *** [source/creator/CMakeFiles/blender.dir/all] Error 2
make: *** [all] Error 2

I'll try again in a day or two in case it's just something they've not fixed in the code yet.

mrunion commented on 2013-04-05 23:57

The latest CUDA update fixed this problem. Cool!

mrunion commented on 2013-04-04 03:12

Anyone else having this issue when building:

Scanning dependencies of target cycles_kernel_cuda
[ 84%] Generating kernel_sm_20.cubin
nvcc warning : Option '--opencc-options (-Xopencc)' is obsolete and ignored, when targeting compute_20, sm_20, or higher
/usr/include/c++/4.8.0/cstdlib(178): error: identifier "__int128" is undefined

/usr/include/c++/4.8.0/cstdlib(179): error: identifier "__int128" is undefined

2 errors detected in the compilation of "/tmp/tmpxft_00004173_00000000-6_kernel.cpp1.ii".
make[2]: *** [intern/cycles/kernel/kernel_sm_20.cubin] Error 2
make[1]: *** [intern/cycles/kernel/CMakeFiles/cycles_kernel_cuda.dir/all] Error 2
make: *** [all] Error 2
==> ERROR: A failure occurred in build().

Is this gcc 4.8.0 related?

stativ commented on 2012-12-03 10:29

mrunion: thank you, fixed.

mrunion commented on 2012-11-29 03:41

Didn't the CUDA toolkit change paths to /opt/cuda instead of /opt/cuda-toolkit? It has on my system, aparently!

mosra commented on 2012-10-27 21:44

Building should be fixed now.