Package Details: belle-sip-git 4.5.0.alpha.r18.g2168cef-1

Git Clone URL: (read-only, click to copy)
Package Base: belle-sip-git
Description: A Voice-over-IP phone
Upstream URL:
Licenses: GPL3
Conflicts: belle-sip
Provides: belle-sip=4.5.0.alpha.r18.g2168cef
Submitter: IncredibleLaser
Maintainer: thrasibule
Last Packager: thrasibule
Votes: 4
Popularity: 0.000000
First Submitted: 2015-02-02 20:53
Last Updated: 2020-09-14 17:25

Latest Comments

1 2 Next › Last »

halogene commented on 2019-09-03 14:36

I get this during prepare:

patching file belle-sip/src/dns.h Hunk #1 FAILED at 158. 1 out of 1 hunk FAILED -- saving rejects to file belle-sip/src/dns.h.rej

franklucido commented on 2019-07-31 10:42

Comparison pages on doubango vs belle-sip vs Pjsip are also included into the resources list. Here's one more package project on repology:

malus commented on 2019-07-09 07:44

Hey thrasibule, could you please add 'git' and 'cmake' to makedepends? Thank you!

dreieck commented on 2019-01-16 13:54

Can you add =${pkgver} to the provides=(belle-sip)-entry?

frealgagu commented on 2018-05-12 17:58

An error is happening to me:

[  4%] Building C object src/CMakeFiles/bellesip.dir/belle_sdp_impl.c.o
/tmp/aur/belle-sip-git/src/belle-sip/src/belle_sdp_impl.c: In function ‘belle_sdp_media_description_append_values_from_mime_parameter’:
/tmp/aur/belle-sip-git/src/belle-sip/src/belle_sdp_impl.c:1057:35: error: ‘snprintf’ output may be truncated before the last format character [-Werror=format-truncation=]
/tmp/aur/belle-sip-git/src/belle-sip/src/belle_sdp_impl.c:1057:3: note: ‘snprintf’ output between 2 and 11 bytes into a destination of size 10
/tmp/aur/belle-sip-git/src/belle-sip/src/belle_sdp_impl.c:1066:43: error: ‘snprintf’ output may be truncated before the last format character [-Werror=format-truncation=]
/tmp/aur/belle-sip-git/src/belle-sip/src/belle_sdp_impl.c:1066:3: note: ‘snprintf’ output between 2 and 11 bytes into a destination of size 10
cc1: all warnings being treated as errors
make[2]: *** [src/CMakeFiles/bellesip.dir/build.make:89: src/CMakeFiles/bellesip.dir/belle_sdp_impl.c.o] Error 1
make[1]: *** [CMakeFiles/Makefile2:106: src/CMakeFiles/bellesip.dir/all] Error 2
make: *** [Makefile:152: all] Error 2
==> ERROR: A failure occurred in build().

artos commented on 2018-02-05 00:25

sed: impossible de lire cmake/FindAntlr3.cmake: Aucun fichier ou dossier de ce type

File doesn’t exist, if I supress sed line of the PKGBUILD, build is ok.

IncredibleLaser commented on 2017-10-14 09:01

Sorry everyone, I neglected my AUR packages the last years. Orphaning those now.

pezz commented on 2017-08-16 01:44

Build currently failing:

Making all in grammars
make[3]: Entering directory '/var/tmp/yaourt-tmp-pezz/aur-belle-sip-git/src/belle-sip/src/grammars'
/usr/bin/java -Xmx512m -jar /var/tmp/yaourt-tmp-pezz/aur-belle-sip-git/src/antlr.jar -make -Xmultithreaded -Xconversiontimeout 10000 -fo . ./belle_sip_message.g
two-threaded DFA conversion
two-threaded DFA conversion
CC libbellesip_generated_la-belle_sip_messageParser.lo
In file included from ../../include/belle-sip/object.h:23:0,
from ../../include/belle-sip/types.h:22,
from belle_sip_messageParser.h:890,
from belle_sip_messageParser.c:81:
../../include/belle-sip/utils.h:39:10: fatal error: bctoolbox/vconnect.h: No such file or directory
#include "bctoolbox/vconnect.h"
compilation terminated.
make[3]: *** [Makefile:435: libbellesip_generated_la-belle_sip_messageParser.lo] Error 1
make[3]: Leaving directory '/var/tmp/yaourt-tmp-pezz/aur-belle-sip-git/src/belle-sip/src/grammars'
make[2]: *** [Makefile:1054: all-recursive] Error 1
make[2]: Leaving directory '/var/tmp/yaourt-tmp-pezz/aur-belle-sip-git/src/belle-sip/src'
make[1]: *** [Makefile:509: all-recursive] Error 1
make[1]: Leaving directory '/var/tmp/yaourt-tmp-pezz/aur-belle-sip-git/src/belle-sip'
make: *** [Makefile:416: all] Error 2

thrasibule commented on 2017-07-08 19:37

I've updated the PKGBUILD to use cmake, which is now preferred by upstream:

marmistrz commented on 2017-02-04 14:50

First of all, bctoolbox and bcunit should be the required dependencies. Besides, the build fails:

transports/udp_listeningpoint.c: In function ‘create_udp_socket’:
transports/udp_listeningpoint.c:112:8: warning: implicit declaration of function ‘bctbx_getnameinfo’ [-Wimplicit-function-declaration]
err=bctbx_getnameinfo((struct sockaddr*)&saddr,saddr_len,NULL,0,portnum,sizeof(portnum),NI_NUMERICSERV|NI_NUMERICHOST);
CC transports/libbellesip_la-udp_channel.lo
transports/udp_channel.c: In function ‘udp_channel_recv’:
transports/udp_channel.c:62:17: error: ‘BCTBX_ENOTCONN’ undeclared (first use in this function)
if (errnum == BCTBX_ENOTCONN) { //Do NOT treat it as an error
transports/udp_channel.c:62:17: note: each undeclared identifier is reported only once for each function it appears in
transports/udp_channel.c: In function ‘udp_channel_connect’:
transports/udp_channel.c:80:44: error: ‘BCTBX_EHOSTUNREACH’ undeclared (first use in this function)