Package Details: bear 3.0.2-1

Git Clone URL: (read-only, click to copy)
Package Base: bear
Description: tool to generate compilation database for clang tooling
Upstream URL:
Licenses: GPL3
Conflicts: bear
Provides: bear
Submitter: mlq
Maintainer: xythrez
Last Packager: xythrez
Votes: 40
Popularity: 0.67
First Submitted: 2013-07-08 09:40
Last Updated: 2020-11-09 03:21

Latest Comments

« First ‹ Previous 1 2

Cake commented on 2018-11-27 13:52

The installation failed with the error as follows:

The following tests FAILED:
      1 - func_test (Failed)
Errors while running CTest
make[3]: *** [test/CMakeFiles/check.dir/build.make:57: test/CMakeFiles/check] Error 8
make[3]: Target 'test/CMakeFiles/check.dir/build' not remade because of errors.
make[2]: *** [CMakeFiles/Makefile2:164: test/CMakeFiles/check.dir/all] Error 2
make[1]: *** [CMakeFiles/Makefile2:171: test/CMakeFiles/check.dir/rule] Error 2
make[1]: Target 'check' not remade because of errors.
make: *** [Makefile:199: check] Error 2
==> ERROR: A failure occurred in check().
==> ERROR: Makepkg was unable to build bear.
==> Restart building bear ? [y/N]

GeeXT commented on 2017-11-05 00:10

Update please. This version has a bug with newlocale that was fixed in latest minor release.

LeonardK commented on 2016-10-24 08:44

oops, wrong link but 2.2.1 is out :)

rizsotto commented on 2015-01-29 11:30

Moritz, thanks for the fix!

rizsotto commented on 2015-01-28 11:20

Please note, that the new version 2.x dependencies were changed. It no longer depends on libconfig, and the executable is written in Python.

pie3 commented on 2014-10-09 13:37

Fails with:
/home/pie3/.aur/bear/src/Bear-1.4.3/src/stringarray.c:148:5: error: ‘for’ loop initial declarations are only allowed in C99 or C11 mode
for (char const * const * it = in; (it) && (*it); ++it)

Anonymous comment on 2013-08-13 17:47

Please make haskell-pandoc an option dependency.
It has over 1GB in dependencies, and is completely unnecessary.
Installs fine if it is removed from the pkgbuild.