Package Details: astrometry.net 0.85-1

Git Clone URL: https://aur.archlinux.org/astrometry.net.git (read-only, click to copy)
Package Base: astrometry.net
Description: Automatic recognition of astronomical images
Upstream URL: http://astrometry.net
Keywords: astrometry astronomy science
Licenses: GPL
Submitter: gypaetus
Maintainer: Universebenzene
Last Packager: Universebenzene
Votes: 6
Popularity: 0.000722
First Submitted: 2016-02-05 23:11
Last Updated: 2021-04-10 16:45

Pinned Comments

procras commented on 2018-08-07 12:32

If solve-field is now crashing for you with errors about removelines.py and fits.py Ensure you have updated your installation of python-astropy The newer version 3.0.4-1 from AUR prevents the crash.

Universebenzene commented on 2017-07-22 13:12

[Attention] This package is now moved to python 3 (from version 0.72). If you still want a python 2 version, you can told us or just create an additional package for python 2 yourself.

Latest Comments

1 2 3 4 Next › Last »

pozar87 commented on 2021-05-09 17:01

Hi! I did finally managed to build this package on Manjaro. Perhaps it's just my setup, but previously I just need to disable parallel builds. This time however (0.85 version) it required a lot of changes in LDFLAGS and CFLAGS for make ...

angelsl commented on 2021-04-10 09:21

The package's Makefile doesn't specify its dependencies properly, so building fails sporadically (and more often if you have high parallelism). The build() should be split up:

make -C util config
make SYSTEM_GSL=yes all
make SYSTEM_GSL=yes py
make SYSTEM_GSL=yes extra

Lightwell commented on 2020-10-22 17:04

Hi - Iḿ trying to make astrometry.net for Kstars on Manjaro.

I get the build error:

make[1]: No rule to make target '../util/libanutils.a', needed by 'spherematch_c.cpython-38-x86_64-linux-gnu.so'. Stop. make[1]: Waiting for unfinished jobs.... make[1]: Leaving directory '/var/tmp/pamac-build-richardhornby/astrometry.net/src/astrometry.net-0.80/libkd' make: *** [Makefile:116: libkd-spherematch] Error 2 ==> ERROR: A failure occurred in build(). Aborting...

I can´t find libanutils in pamac, and it is not listed as a dependency either for astrometry.net or for python-astropy.

I am at the limit of my learning curve and may well have missed something.

Help pls?

Tks

R

Lightwell commented on 2020-10-22 17:04

Hi - Iḿ trying to make astrometry.net for Kstars on Manjaro.

I get the build error:

make[1]: No rule to make target '../util/libanutils.a', needed by 'spherematch_c.cpython-38-x86_64-linux-gnu.so'. Stop. make[1]: Waiting for unfinished jobs.... make[1]: Leaving directory '/var/tmp/pamac-build-richardhornby/astrometry.net/src/astrometry.net-0.80/libkd' make: *** [Makefile:116: libkd-spherematch] Error 2 ==> ERROR: A failure occurred in build(). Aborting...

I can´t find libanutils in pamac, and it is not listed as a dependency either for astrometry.net or for python-astropy.

I am at the limit of my learning curve and may well have missed something.

Help pls?

Tks

R

pozar87 commented on 2020-03-03 10:04

Hi! There is a problem with parallel build - see the https://github.com/dstndstn/astrometry.net/issues/178 I workaround it adding export MAKEFLAGS="-j 1" just before makes invocations - but I'm not sure its the best way :) Best Regards,

Universebenzene commented on 2019-08-02 16:05

@pierros I think the python modules installed globally in the system will be ignored by virtualenv.

pierros commented on 2019-08-02 09:52

Solve-field is failing inside a python virtual-env with the following error:

Traceback (most recent call last): File "/usr/bin/image2pnm", line 14, in <module> from astrometry.util.image2pnm import main ModuleNotFoundError: No module named 'astrometry'

Universebenzene commented on 2019-07-13 17:15

@pierros This problem is caused by the recent upgrade of wcslib. Downgrading wcslib to the versoin 6.2 will fix it. Or you can just use https://aur.archlinux.org/packages/wcslib62/ instead.

pierros commented on 2019-07-13 12:28

Build is failing: gcc -Wl,-O1,--sort-common,--as-needed,-z,relro,-z,now -Wl,-O1,--sort-common,--as-needed,-z,relro,-z,now -g -Wall -ffinite-math-only -fno-signaling-nans -pthread -march=native -O3 -fomit-frame-pointer -DNDEBUG -fpic -Winline wcs-to-tan.o libanutils.a ../qfits-an/libqfits.a libanbase.a -lgsl -lgslcblas -lm -lwcs -lm -lm -lgsl -lgslcblas -lm -lwcs -lm -lm -o wcs-to-tan /usr/bin/ld: /usr/lib/gcc/x86_64-pc-linux-gnu/9.1.0/../../../../lib/libwcs.so: undefined reference to gFitsFiles' /usr/bin/ld: /usr/lib/gcc/x86_64-pc-linux-gnu/9.1.0/../../../../lib/libwcs.so: undefined reference tofits_read_wcstab' collect2: error: ld returned 1 exit status make[1]: [<builtin>: wcs-to-tan] Error 1 make[1]: Leaving directory '/home/liknus/.cache/aurman/astrometry.net/src/astrometry.net-0.78/util' make: [Makefile:87: util] Error 2 ==> ERROR: A failure occurred in build(). Aborting... 2019-07-13 15:26:31,501 - wrappers - makepkg - ERROR - makepkg query ['makepkg', '-cf', '--noconfirm'] failed in directory /home/liknus/.cache/aurman/astrometry.net

Universebenzene commented on 2019-04-04 06:57

@JamesHarrison Thanks. I changed the source from github to astrometry.net. You can check it again.