Package Details: astroid 0.15-4

Git Clone URL: (read-only, click to copy)
Package Base: astroid
Description: a graphical threads-with-tags style, lightweight and fast, email client for notmuch, inspired by sup and others
Upstream URL:
Keywords: mail
Licenses: GPL
Submitter: gauteh
Maintainer: gauteh (jheinz)
Last Packager: jheinz
Votes: 23
Popularity: 1.00
First Submitted: 2015-09-20 10:24
Last Updated: 2019-07-19 11:14

Latest Comments

« First ‹ Previous ... 2 3 4 5 6 7 8 9 Next › Last »

gauteh commented on 2016-11-01 11:41

@grazzolini: yes please, please submit it at:

grazzolini commented on 2016-11-01 11:38


It seems astroid doesn't build against the new boost version 1.62.0-2. I get several errors trying to build it with it. If you want I can send you a makepkg log.

gauteh commented on 2016-09-12 20:19

@idiotbox: should be fixed now!

idiotbox commented on 2016-09-12 20:14


getting this when compiling:

src/modes/ In static member function 'static void Astroid::Keybindings::init()':
src/modes/ error: 'spec' was not declared in this scope
LOG (error) << "ky: user bindings: invalid key name: " << spec;
scons: *** [src/modes/keybindings.o] Error 1
scons: building terminated because of errors.

gauteh commented on 2016-08-01 07:37

Hi, this should be fixed now: Added the python-gobject makedep.

idiotbox commented on 2016-07-29 12:08

Getting the following error message on check function:

[info ] (12:36:31): poll: periodic polling disabled.
[info ] (12:36:31): ac: deinitializing.
terminate called without an active exception
unknown location(0): fatal error: in "Generic/setup_test": signal: SIGABRT (application abort requested)
test/ last checkpoint: "setup_test" entry.

*** 1 failure is detected in the test module "TestGeneric"
scons: *** [test/test_generic.passed] Error 1
scons: building terminated because of errors.
==> ERRO: Uma falha ocorreu em check().

Also, had to install python-gobject for the compilation, which was not listed as a dependency.

vide commented on 2016-07-10 16:32

@gauteh: thanks!

gauteh commented on 2016-07-10 16:23

@vide: yes - added!

vide commented on 2016-07-10 16:10

I had also to install gobject-introspection. Should this be a dependency?

runical commented on 2016-06-09 13:42

Yes, the lack of an UTF-8 locale is because of the process of making a chroot with mkarchchroot. This installs a basic Arch system without any locale defined. I'll try to set up a chroot with a defined locale later.

As for the /tmp, I have no clue how to test this. If the tests normally write to a directory, it should work in a chroot as well. As in, there should be a /tmp directory.

I'll get back to you later after I run some tests. If there is still a problem, I'll open an issue on Github.