Package Details: aseprite-git 1.2.13.r0.gaf4fd54c2-3

Git Clone URL: https://aur.archlinux.org/aseprite-git.git (read-only)
Package Base: aseprite-git
Description: Create animated sprites and pixel art
Upstream URL: http://www.aseprite.org/
Licenses: custom, BSD
Conflicts: aseprite, aseprite-gpl
Submitter: benob
Maintainer: jusw85
Last Packager: jusw85
Votes: 4
Popularity: 0.000000
First Submitted: 2012-10-10 08:10
Last Updated: 2019-07-10 16:43

Latest Comments

1 2 3 Next › Last »

jusw85 commented on 2019-07-10 16:38

@hollunder Try rebuilding(i.e. pacman -S aseprite-git) aseprite after upgrading nettle, fixed it for me

hollunder commented on 2019-07-10 15:50

No longer runs, as it depends on libnettle.so.6 but we have libnettle.so.7 now.

skrat commented on 2017-04-23 21:09

It doesn't build:

/tmp/yaourt-tmp-xxx/aur-aseprite-git/src/aseprite/src/ft/stream.cpp:11:40: fatal error: freetype/internal/internal.h: No such file or directory
#include <freetype/internal/internal.h>

Event though that file can be found at

src/aseprite/third_party/freetype2/include/freetype/internal/internal.h

hollunder commented on 2017-03-04 16:29

Also still missing:
makedepends: git
depends: libx11, libwebp

but even with that the package() function fails.
==> Starting package()...
Install the project...
-- Install configuration: "RelWithDebInfo"
-- Installing: /build/aseprite-git/pkg/aseprite-git/usr/lib/pkgconfig/libcmark.pc
CMake Error at third_party/cmark/src/cmake_install.cmake:46 (file):
file INSTALL cannot find
"/build/aseprite-git/src/aseprite/build/bin/cmark".
Call Stack (most recent call first):
third_party/cmark/cmake_install.cmake:37 (include)
third_party/cmake_install.cmake:39 (include)
cmake_install.cmake:37 (include)


make: *** [Makefile:123: install/fast] Error 1
==> ERROR: A failure occurred in package().
Aborting...

hollunder commented on 2017-03-04 09:35

==> Starting package()...
Install the project...
-- Install configuration: "RelWithDebInfo"
-- Installing: /build/aseprite-git/pkg/aseprite-git/usr/lib/pkgconfig/libcmark.pc
CMake Error at third_party/cmark/src/cmake_install.cmake:46 (file):
file INSTALL cannot find
"/build/aseprite-git/src/aseprite/build/bin/cmark".
Call Stack (most recent call first):
third_party/cmark/cmake_install.cmake:37 (include)
third_party/cmake_install.cmake:39 (include)
cmake_install.cmake:37 (include)


make: *** [Makefile:123: install/fast] Error 1
==> ERROR: A failure occurred in package().
Aborting...

hollunder commented on 2016-12-20 11:55

The missing dependency seems to be libx11 for all three versions. libwebp is missing only in this one.

-- Found Threads: TRUE
-- Looking for XOpenDisplay in /usr/lib64/libX11.so
-- Looking for XOpenDisplay in /usr/lib64/libX11.so - found

hollunder commented on 2016-12-20 11:24

Another build error:

-- No package 'libwebp' found
CMake Error at CMakeLists.txt:221 (message):
libwebp not found

hollunder commented on 2016-12-20 11:13

Even the git package is missing the git makedepend.

benob commented on 2016-09-12 17:05

Should be fixed in v6 of PKGBUILD

koushien commented on 2016-09-12 06:52

Makepkg aborts after the following error:
##
install: cannot create regular file /usr/share/licenses/aseprite/EULA.txt: Permission denied
##
Anything I should try?