Package Details: aria2-fast 1.35.0-2

Git Clone URL: https://aur.archlinux.org/aria2-fast.git (read-only, click to copy)
Package Base: aria2-fast
Description: Aria2 Download utility with little patch to maximize aria2 download speed
Upstream URL: http://aria2.sourceforge.net/
Licenses: GPL
Conflicts: aria2
Provides: aria2
Submitter: agus.winger
Maintainer: pandada8
Last Packager: pandada8
Votes: 15
Popularity: 0.81
First Submitted: 2012-05-31 12:24
Last Updated: 2020-04-07 11:07

Required by (48)

Sources (2)

Latest Comments

1 2 Next › Last »

redfanglicker commented on 2020-02-21 08:46

hows this different from the normal version?

Kr1ss commented on 2019-07-07 13:06

Hi, thx a lot for maintaining this package !

I stumbled over the recent update of core/nettle, since this has bumped a shared object library (libnettle.so.{6.5,7.0}), causing aria2c to fail at runtime. However, rebuilding aria2-fast against nettle 3.5.1 solves the issue.

Maybe you could increase the pkgrel to indicate that a rebuild is necessary when a user updates their system ?

Cheers !

pandada8 commented on 2018-10-07 04:50

@DDoSolitary, sorry, should be fixed

DDoSolitary commented on 2018-10-07 00:43

Build failing, please update md5sums for aria2-fast.patch

lifehome commented on 2016-09-09 10:23

aria2 1.26.1 is out, plus the git source link is not updated to aria2/aria2.
Please fix this <3

ryansito commented on 2016-01-11 22:00

@pandada8 I've fixed it, I was blocking the multicast port so I've opened it in the firewall. Thanks!!

ryansito commented on 2016-01-10 19:01

@pandada8 thanks I'll try.

pandada8 commented on 2016-01-10 04:57

@ryansito no problem here
BTW, this patch would not let the test fail, try rebuild or build the original "aria2" package to see if any test failed

ryansito commented on 2016-01-10 03:29

Won't build for me with a check error.
CXXLD aria2c
make[2]: Leaving directory '/home/user/Downloads/aria2-fast/src/aria2-1.19.3/test'
make check-TESTS
make[2]: Entering directory '/home/user/Downloads/aria2-fast/src/aria2-1.19.3/test'
make[3]: Entering directory '/home/user/Downloads/aria2-fast/src/aria2-1.19.3/test'
FAIL: aria2c
============================================================================
Testsuite summary for aria2 1.19.3
============================================================================
# TOTAL: 1
# PASS: 0
# SKIP: 0
# XFAIL: 0
# FAIL: 1
# XPASS: 0
# ERROR: 0
============================================================================
See test/test-suite.log
Please report to https://github.com/tatsuhiro-t/aria2/issues
============================================================================
Makefile:1391: recipe for target 'test-suite.log' failed
make[3]: *** [test-suite.log] Error 1
make[3]: Leaving directory '/home/user/Downloads/aria2-fast/src/aria2-1.19.3/test'
Makefile:1497: recipe for target 'check-TESTS' failed
make[2]: *** [check-TESTS] Error 2
make[2]: Leaving directory '/home/user/Downloads/aria2-fast/src/aria2-1.19.3/test'
Makefile:1570: recipe for target 'check-am' failed
make[1]: *** [check-am] Error 2
make[1]: Leaving directory '/home/user/Downloads/aria2-fast/src/aria2-1.19.3/test'
Makefile:540: recipe for target 'check-recursive' failed
make: *** [check-recursive] Error 1
==> ERROR: A failure occurred in check().

pandada8 commented on 2015-09-29 15:50

the patch is udpated