Package Details: arduide-git 0.r340.8beb733-1

Git Clone URL: https://aur.archlinux.org/arduide-git.git (read-only, click to copy)
Package Base: arduide-git
Description: ArduIDE is a Qt-based IDE for the open-source Arduino electronics prototyping platform.
Upstream URL: http://mupuf.org/project/arduide.html
Licenses: GPL
Submitter: MuPuF
Maintainer: aviallon (ZenoFuturista)
Last Packager: aviallon
Votes: 79
Popularity: 0.000001
First Submitted: 2010-08-16 00:45
Last Updated: 2018-10-31 12:59

Latest Comments

« First ‹ Previous ... 2 3 4 5 6 7 8 9 10 11 Next › Last »

enteenteente commented on 2012-02-26 16:51

@MuPuF
Here they are:
community/avr-binutils 2.22-2
community/avr-gcc 4.6.2-1
community/avr-libc 1.8.0-1

MuPuF commented on 2012-02-26 16:30

@enteenteente: Saddly, I cannot reproduce this problem. Could you post all the avr-* packages you use (libc, gcc, binutils) please ?

enteenteente commented on 2012-02-26 15:58

Dont' knwo what i'm doing wrong but im always getting the following error:

Compiling for Arduino Uno...
>>>> avr-g++ -c -g -Os -w -fno-exceptions -ffunction-sections -fdata-sections -mmcu=atmega328p -DF_CPU=16000000L -DARDUINO=22 -I/home/ente/.local/share/data/MuPuF.org/Arduino IDE/arduino-0022/hardware/arduino/cores/arduino -o /tmp/arduino-buildpUy04w/HardwareSerial.cpp.o /home/ente/.local/share/data/MuPuF.org/Arduino IDE/arduino-0022/hardware/arduino/cores/arduino/HardwareSerial.cpp
In file included from /usr/lib/gcc/avr/4.6.2/../../../../avr/include/util/delay.h:44:0,
from /usr/lib/gcc/avr/4.6.2/../../../../avr/include/avr/delay.h:37,
from /home/ente/.local/share/data/MuPuF.org/Arduino IDE/arduino-0022/hardware/arduino/cores/arduino/wiring_private.h:30,
from /home/ente/.local/share/data/MuPuF.org/Arduino IDE/arduino-0022/hardware/arduino/cores/arduino/HardwareSerial.cpp:28:
/usr/lib/gcc/avr/4.6.2/../../../../avr/include/math.h:426:15: error: expected unqualified-id before 'double'
/usr/lib/gcc/avr/4.6.2/../../../../avr/include/math.h:426:15: error: expected ')' before 'double'
/usr/lib/gcc/avr/4.6.2/../../../../avr/include/math.h:426:15: error: expected ')' before 'double'
Compilation failed.

CountMurphy commented on 2012-02-26 02:16

After the lastest build, nothing compiles for any board (even with empty setup and loop). This is the error I am getting:


/usr/share/arduino/hardware/arduino/cores/arduino/Print.cpp: In member function 'size_t Print::print(const __FlashStringHelper*)':
/usr/share/arduino/hardware/arduino/cores/arduino/Print.cpp:44:9: error: 'prog_char' does not name a type
/usr/share/arduino/hardware/arduino/cores/arduino/Print.cpp:47:23: error: 'p' was not declared in this scope

Any ideas?

MuPuF commented on 2012-02-25 12:25

You're welcome, I don't work on it enough but we'll (hopefully) soon support multi-file pde and continuous serial reading.

broken.pipe commented on 2012-02-25 12:23

i have to thank you! awesome software! the arduino java crap drove me nuts!! and this simply works! :)

MuPuF commented on 2012-02-25 11:50

@broken.pipe: Done, thank you

broken.pipe commented on 2012-02-25 10:12

pls add qtwebkit as dep.

MuPuF commented on 2012-02-19 19:46

@jeedo: Sorry for the late answer, could you try installing libwebkit? I don't understand what is wrong since I do what I think should be done and a rapid check to some qt browsers using webkit seems to prove me right.

If it does fail again, could you try reinstalling cmake, qt and libwebkit please?

Anonymous comment on 2012-02-09 03:09

Just attempted to makepkg and ran into the following error during compile:

-- Found Qt4: /usr/bin/qmake (found version "4.8.0")
CMake Error at /usr/share/cmake-2.8/Modules/FindPackageHandleStandardArgs.cmake:91 (MESSAGE):
Could NOT find Qt4 (missing: QT_QTWEBKIT_INCLUDE_DIR QT_QTWEBKIT_LIBRARY)
(found version "4.8.0")
Call Stack (most recent call first):
/usr/share/cmake-2.8/Modules/FindPackageHandleStandardArgs.cmake:252 (_FPHSA_FAILURE_MESSAGE)
/usr/share/cmake-2.8/Modules/FindQt4.cmake:1171 (FIND_PACKAGE_HANDLE_STANDARD_ARGS)
CMakeLists.txt:108 (find_package)


-- Configuring incomplete, errors occurred!
==> ERROR: A failure occurred in build().
Aborting...


And the qt dependency is installed:

[root@compaq arduide-git]# pacman -Qi qt
Name : qt
Version : 4.8.0-4
URL : http://qt-project.org/
Licenses : GPL3 LGPL
Groups : None
Provides : None
Depends On : libtiff libpng libmng sqlite3 ca-certificates glib2 dbus
fontconfig libgl libsm libxrandr libxv libxi alsa-lib
xdg-utils hicolor-icon-theme desktop-file-utils
Optional Deps : postgresql-libs: PostgreSQL driver
libmysqlclient: MySQL driver
unixodbc: ODBC driver
libxinerama: Xinerama support
libxcursor: Xcursor support
libxfixes: Xfixes support
Required By : grantlee qscintilla
Conflicts With : None
Replaces : None
Installed Size : 91224.00 KiB
Packager : Andrea Scarpino <andrea@archlinux.org>
Architecture : i686
Build Date : Tue 31 Jan 2012 07:46:07 AM EST
Install Date : Thu 09 Feb 2012 01:54:09 PM EST
Install Reason : Installed as a dependency for another package
Install Script : Yes
Description : A cross-platform application and UI framework


Are the dependencies missing something in the PKGBUILD?