Package Details: arc_unpacker-git r2427.9c2781fc-1

Git Clone URL: https://aur.archlinux.org/arc_unpacker-git.git (read-only, click to copy)
Package Base: arc_unpacker-git
Description: CLI tool for extracting images and sounds from visual novels.
Upstream URL: https://github.com/vn-tools/arc_unpacker
Licenses: GPL
Conflicts: arc_unpacker
Provides: arc_unpacker, arc_unpacker-git
Submitter: sebba
Maintainer: absrdspc
Last Packager: absrdspc
Votes: 2
Popularity: 0.24
First Submitted: 2017-07-22 16:13
Last Updated: 2021-07-19 09:31

Latest Comments

wallena3 commented on 2021-04-20 12:14

it work now, thanks

absrdspc commented on 2021-04-19 21:32

Should work now

wallena3 commented on 2021-04-16 05:12

@absrdspc Yes, fully update. Here are failed tests:

CLI facade Unpacking archives with CLI facade


/home/wallen/.cache/yay/arc_unpacker-git/src/arc_unpacker-git/tests/cli_facade_test.cc:44 ...............................................................................

/home/wallen/.cache/yay/arc_unpacker-git/src/arc_unpacker-git/tests/cli_facade_test.cc:56: FAILED: REQUIRE( io::is_directory("./xp3-v2~.xp3") ) with expansion: false


Archives reference only valid decoders

/home/wallen/.cache/yay/arc_unpacker-git/src/arc_unpacker-git/tests/dec/archive_decoder_linkage_test.cc:24 ...............................................................................

/home/wallen/.cache/yay/arc_unpacker-git/src/arc_unpacker-git/tests/dec/archive_decoder_linkage_test.cc:39: FAILED: {Unknown expression after the reported line} due to unexpected exception with message: Could not open /usr/etc/xp3/karakara.dat


KiriKiri XP3 archives Version 1


/home/wallen/.cache/yay/arc_unpacker-git/src/arc_unpacker-git/tests/dec/kirikiri/xp3_archive_decoder_test.cc:44 ...............................................................................

/home/wallen/.cache/yay/arc_unpacker-git/src/arc_unpacker-git/tests/dec/kirikiri/xp3_archive_decoder_test.cc:44: FAILED: due to unexpected exception with message: Could not open /usr/etc/xp3/karakara.dat


KiriKiri XP3 archives Version 2


/home/wallen/.cache/yay/arc_unpacker-git/src/arc_unpacker-git/tests/dec/kirikiri/xp3_archive_decoder_test.cc:49 ...............................................................................

/home/wallen/.cache/yay/arc_unpacker-git/src/arc_unpacker-git/tests/dec/kirikiri/xp3_archive_decoder_test.cc:49: FAILED: due to unexpected exception with message: Could not open /usr/etc/xp3/karakara.dat


KiriKiri XP3 archives Compressed file table


/home/wallen/.cache/yay/arc_unpacker-git/src/arc_unpacker-git/tests/dec/kirikiri/xp3_archive_decoder_test.cc:54 ...............................................................................

/home/wallen/.cache/yay/arc_unpacker-git/src/arc_unpacker-git/tests/dec/kirikiri/xp3_archive_decoder_test.cc:54: FAILED: due to unexpected exception with message: Could not open /usr/etc/xp3/karakara.dat


KiriKiri XP3 archives Compressed file data


/home/wallen/.cache/yay/arc_unpacker-git/src/arc_unpacker-git/tests/dec/kirikiri/xp3_archive_decoder_test.cc:59 ...............................................................................

/home/wallen/.cache/yay/arc_unpacker-git/src/arc_unpacker-git/tests/dec/kirikiri/xp3_archive_decoder_test.cc:59: FAILED: due to unexpected exception with message: Could not open /usr/etc/xp3/karakara.dat


KiriKiri XP3 archives Multiple SEGM chunks


/home/wallen/.cache/yay/arc_unpacker-git/src/arc_unpacker-git/tests/dec/kirikiri/xp3_archive_decoder_test.cc:64 ...............................................................................

/home/wallen/.cache/yay/arc_unpacker-git/src/arc_unpacker-git/tests/dec/kirikiri/xp3_archive_decoder_test.cc:64: FAILED: due to unexpected exception with message: Could not open /usr/etc/xp3/karakara.dat


KiriKiri XP3 archives Shuffled chunks


/home/wallen/.cache/yay/arc_unpacker-git/src/arc_unpacker-git/tests/dec/kirikiri/xp3_archive_decoder_test.cc:69 ...............................................................................

/home/wallen/.cache/yay/arc_unpacker-git/src/arc_unpacker-git/tests/dec/kirikiri/xp3_archive_decoder_test.cc:69: FAILED: due to unexpected exception with message: Could not open /usr/etc/xp3/karakara.dat


KiriKiri XP3 archives 'time' chunk


/home/wallen/.cache/yay/arc_unpacker-git/src/arc_unpacker-git/tests/dec/kirikiri/xp3_archive_decoder_test.cc:74 ...............................................................................

/home/wallen/.cache/yay/arc_unpacker-git/src/arc_unpacker-git/tests/dec/kirikiri/xp3_archive_decoder_test.cc:74: FAILED: due to unexpected exception with message: Could not open /usr/etc/xp3/karakara.dat

absrdspc commented on 2021-04-14 00:55

@wallena3 Can't reproduce it. Are you sure you're fully updated? Can you show failed tests?

wallena3 commented on 2021-04-07 08:39

test cases: 317 | 314 passed | 3 failed assertions: 8629 | 8620 passed | 9 failed

==> ERROR: A failure occurred in check(). Aborting... error making: arc_unpacker-git