Package Details: aquaria-ose-git 1.1.3+o1.002+g611.96206dd-1

Git Clone URL: https://aur.archlinux.org/aquaria-ose-git.git (read-only, click to copy)
Package Base: aquaria-ose-git
Description: A 2D fantasy underwater action-adventure game (Open Source Edition of the engine = original v1.1.3 + many improvements)
Upstream URL: https://github.com/AquariaOSE/Aquaria
Keywords: 2D action adventure fantasy game humble metroidvania underwater
Licenses: GPL
Conflicts: aquaria, aquaria-git, aquaria-hib, aquaria-hib-git, aquaria-hib-hg, aquaria-ose
Replaces: aquaria-git, aquaria-hib-git, aquaria-hib-hg
Submitter: smls
Maintainer: smls
Last Packager: smls
Votes: 43
Popularity: 0.000000
First Submitted: 2015-07-09 14:14
Last Updated: 2016-06-19 20:21

Latest Comments

« First ‹ Previous 1 2 3 4 5 6 7 Next › Last »

smls commented on 2012-09-29 20:14

The fgenesis version of the Aquaria executable (which is used in this package) now relies on an additional data pack that needs to be extracted on top of the game date from the Humble Bundle release: http://www.bit-blot.com/forum/index.php?topic=4313.15

smls commented on 2012-09-29 07:48

The source code revision this PKGBUILD uses is from 2011-11-30, and from an outdated repository. Active development has moved to the https://github.com/fgenesis/Aquaria_clean repository, with the latest tarball released on 2012-07-12: http://www.bit-blot.com/forum/index.php?topic=4313.0

Anonymous comment on 2012-06-09 05:38

I get the next error, please help

http://pastebin.com/i3zYYQ2b

Marvn commented on 2012-05-17 17:43

updated!

hg repo is now https://bitbucket.org/fgenesis/aquaria
used the mikyter patch (thx)

Anonymous comment on 2012-05-12 16:46

@CPUnltd Apply the patch on http://pastebin.com/gwK7gDsM. It makes the source code compatible with gcc 4.7
If you want to use https://bitbucket.org/fgenesis/aquaria you have to apply the patch on http://pastebin.com/jeFvHbTH instead which also fixes a problem with the missing zutil.h .

jose1711 commented on 2012-04-25 17:48

CPUnltd: i just successfully packaged it using this pkgbuild. what is the error you're getting? jose

CPUnltd commented on 2012-04-25 01:56

Is this package abandoned? I really would like to install this game and it seems like no version of this package works anymore...

CPUnltd commented on 2012-04-25 01:54

/tmp/packerbuild-1000/aquaria-hib-hg/aquaria-hib-hg/src/aquaria-build/BBGE/Joystick.cpp: In member function ‘void Joystick::init(int)’:
/tmp/packerbuild-1000/aquaria-hib-hg/aquaria-hib-hg/src/aquaria-build/BBGE/Joystick.cpp:168:18: error: ‘close’ was not declared in this scope
/tmp/packerbuild-1000/aquaria-hib-hg/aquaria-hib-hg/src/aquaria-build/BBGE/Joystick.cpp:173:18: error: ‘close’ was not declared in this scope
/tmp/packerbuild-1000/aquaria-hib-hg/aquaria-hib-hg/src/aquaria-build/BBGE/Joystick.cpp: In member function ‘void Joystick::shutdown()’:
/tmp/packerbuild-1000/aquaria-hib-hg/aquaria-hib-hg/src/aquaria-build/BBGE/Joystick.cpp:210:16: error: ‘close’ was not declared in this scope
/tmp/packerbuild-1000/aquaria-hib-hg/aquaria-hib-hg/src/aquaria-build/BBGE/Joystick.cpp: In member function ‘void Joystick::rumble(float, float, float)’:
/tmp/packerbuild-1000/aquaria-hib-hg/aquaria-hib-hg/src/aquaria-build/BBGE/Joystick.cpp:286:58: error: ‘write’ was not declared in this scope
make[2]: *** [CMakeFiles/aquaria.dir/BBGE/Joystick.cpp.o] Error 1
make[1]: *** [CMakeFiles/aquaria.dir/all] Error 2
make: *** [all] Error 2
==> ERROR: A failure occurred in build().
Aborting...
The build failed.

AlexanderR commented on 2012-03-23 14:20

Development was picked up on https://bitbucket.org/fgenesis/aquaria.

AlexanderR commented on 2012-03-15 03:23

Could you please change way of referencing aquaria-lnx-humble-bundle.mojo.run in "sources" array to one used in worldofgoo package (e.g. http://pastebin.com/zT7VcmNz)? It would clearer demonstrate that archive should be located in user's file system rather than packed with PKGBUILD.