Package Details: appimagelauncher-git r848.adae2d6-1

Git Clone URL: https://aur.archlinux.org/appimagelauncher-git.git (read-only)
Package Base: appimagelauncher-git
Description: A Helper application for running and integrating AppImages.
Upstream URL: https://github.com/TheAssassin/AppImageLauncher
Keywords: appimage
Licenses: MIT
Submitter: AJSlye
Maintainer: FabioLolix
Last Packager: FabioLolix
Votes: 2
Popularity: 0.000261
First Submitted: 2018-04-24 14:08
Last Updated: 2019-09-25 20:08

Latest Comments

« First ‹ Previous 1 2 3 Next › Last »

oberon2007 commented on 2019-04-11 11:16

AJ I am now maintaining the stable release pkg. If you want to orphan the git version I can adopt it, too.

AJSlye commented on 2019-02-03 00:13

There is no xdd package, this is arch. Besides, neovim-drop-in should satisfy the vim dependency.

ConfuZzled commented on 2019-02-02 23:11

The dependencies should be changed so that it doesn't depend on vim, but rather on xdd, since that's what's actually required by the package. Just depending on vim causes build problems when other AUR packages like neovim-drop-in are installed

AJSlye commented on 2019-01-19 20:15

I no longer have a need to maintain this myself, Manjaro has taken over maintaining this package in their own repositories.

Please, make all future inquiries to TheAssassin as he is the developer.

AJSlye commented on 2019-01-15 16:36

This is a git build that pulls from the continuous release tag.

This is NOT a release version, this tag is updated in between releases.

Your installed version will be different than what is listed here.

Please refrain from tagging this out of date.

I will look into, and discuss with TheAssassin, creating a new AUR entry for release versions.

https://github.com/TheAssassin/AppImageLauncher/tags

AJSlye commented on 2019-01-04 20:03

Libappimage is now available in the arch/manjaro repositories. Not sure if this this is useful, or would help minimize build time or not. But I figured that I would mention it: https://www.archlinux.org/packages/extra/x86_64/libappimage/

makeworld commented on 2018-12-30 19:01

I've made an issue on github for this specific problem here: https://github.com/TheAssassin/AppImageLauncher/issues/110

makeworld commented on 2018-12-30 18:54

Here's a better formatted version of what fusion809 posted before:

/home/makeworld/.cache/yay/appimagelauncher-git/src/AppImageLauncher/lib/AppImageUpdate/lib/zsync2/lib/cpr/cpr/error.cpp: In static member function ‘static cpr::ErrorCode cpr::Error::getErrorCodeForCurlError(int32_t)’:
/home/makeworld/.cache/yay/appimagelauncher-git/src/AppImageLauncher/lib/AppImageUpdate/lib/zsync2/lib/cpr/cpr/error.cpp:41:9: error: duplicate case value
         case CURLE_SSL_CACERT:
         ^~~~
/home/makeworld/.cache/yay/appimagelauncher-git/src/AppImageLauncher/lib/AppImageUpdate/lib/zsync2/lib/cpr/cpr/error.cpp:25:9: note: previously used here
         case CURLE_PEER_FAILED_VERIFICATION:
         ^~~~
make[2]: *** [lib/AppImageUpdate/lib/zsync2/lib/cpr/cpr/CMakeFiles/cpr.dir/build.make:115: lib/AppImageUpdate/lib/zsync2/lib/cpr/cpr/CMakeFiles/cpr.dir/error.cpp.o] Error 1
make[1]: *** [CMakeFiles/Makefile2:2459: lib/AppImageUpdate/lib/zsync2/lib/cpr/cpr/CMakeFiles/cpr.dir/all] Error 2
make: *** [Makefile:152: all] Error 2
==> ERROR: A failure occurred in build().
    Aborting...
Error making: appimagelauncher-git

AJSlye commented on 2018-12-22 14:06

This is not meant to be built on Arch testing. By the time testing packages are in stable these sort of things should be fixed. However, the error looks like a sub-module issue (appimageupdate/zsync2), please give TheAssassin time to work this out in the source code.

fusion809 commented on 2018-12-22 13:58

On an up-to-date Arch system with testing repos enabled I receive the build error:

[ 73%] Building CXX object lib/AppImageUpdate/lib/zsync2/lib/cpr/cpr/CMakeFiles/cpr.dir/digest.cpp.o [ 75%] Building CXX object lib/AppImageUpdate/lib/zsync2/lib/cpr/cpr/CMakeFiles/cpr.dir/error.cpp.o /home/fusion809/.cache/yay/appimagelauncher-git/src/AppImageLauncher/lib/AppImageUpdate/lib/zsync2/lib/cpr/cpr/error.cpp: In static member function ‘static cpr::ErrorCode cpr::Error::getErrorCodeForCurlError(int32_t)’: /home/fusion809/.cache/yay/appimagelauncher-git/src/AppImageLauncher/lib/AppImageUpdate/lib/zsync2/lib/cpr/cpr/error.cpp:41:9: error: duplicate case value case CURLE_SSL_CACERT: ^~~~ /home/fusion809/.cache/yay/appimagelauncher-git/src/AppImageLauncher/lib/AppImageUpdate/lib/zsync2/lib/cpr/cpr/error.cpp:25:9: note: previously used here case CURLE_PEER_FAILED_VERIFICATION: ^~~~ make[2]: [lib/AppImageUpdate/lib/zsync2/lib/cpr/cpr/CMakeFiles/cpr.dir/build.make:115: lib/AppImageUpdate/lib/zsync2/lib/cpr/cpr/CMakeFiles/cpr.dir/error.cpp.o] Error 1 make[1]: [CMakeFiles/Makefile2:2459: lib/AppImageUpdate/lib/zsync2/lib/cpr/cpr/CMakeFiles/cpr.dir/all] Error 2 make: *** [Makefile:152: all] Error 2