Package Details: airwave-git r155.8cd3507-3

Git Clone URL: (read-only)
Package Base: airwave-git
Description: Airwave is a WINE-based VST bridge, that allows for the use of Windows 32- and 64-bit VST 2.4 audio plugins with Linux VST hosts
Upstream URL:
Licenses: MIT
Conflicts: airwave
Provides: airwave
Submitter: phant0m
Maintainer: jonathon
Last Packager: jonathon
Votes: 20
Popularity: 0.170038
First Submitted: 2014-07-14 08:53
Last Updated: 2017-04-12 17:23

Latest Comments

1 2 3 Next › Last »

alvafox commented on 2019-01-06 20:54

@mlaqts yes, I have glibc.

In fact, I solved the build problem. If someone wants to know how. When I received another error that pointed to a library containing "include_next", I changed "include_next" to "include" in it, it helped, but this is a very ugly solution imo.

mlaqts commented on 2019-01-06 01:06

@alvafox Do you have glibc installed?

$ pacman -Qo /usr/include/stdlib.h
/usr/include/stdlib.h is owned by glibc 2.28-5

alvafox commented on 2018-11-27 08:28

Hi, I have a error when trying to build this:

/usr/include/c++/8.2.1/cstdlib:75:15: fatal error: stdlib.h: No such file or directory

include_next <stdlib.h>


Does anyone know how to resolve this? On the web I'm finding information about this issue:

Maybe some hacks on the source code or adding Cmake flags might help?

jcelerier commented on 2018-11-21 09:19

Hi, when I build this package I don't get the toolbar in airwave-manager... (it was there on older versions) anyone knows how can I fix this ? thanks !

parataxis0 commented on 2017-12-12 15:50

I made instructions for those of you having issues with the wine layer not rendering the window entirely, or even resizing issues I have heard about. Might or might not resolve graphical issues entirely if you run into them.

Good day!

jonathon commented on 2017-04-12 17:24

Updated. :)

milk commented on 2017-04-12 16:01

Build is failing atm, bug is resolved, removing the patch fixes. Error is;

==> Extracting sources...
-> Creating working copy of airwave git repo...
Cloning into 'airwave'...
Switched to a new branch 'makepkg'
==> Starting prepare()...
patching file airwave/src/host/winnt.h
Hunk #1 FAILED at 5438.
1 out of 1 hunk FAILED -- saving rejects to file airwave/src/host/winnt.h.rej
==> ERROR: A failure occurred in prepare().

jhernberg commented on 2017-02-24 13:32

Yes, builds for me too. Many thanks!

jonathon commented on 2017-02-24 12:20

PKGBUILD updated with upstream's patch; package is building again for me.

jonathon commented on 2017-02-23 11:45

That appears to be an issue with WINE, not airwave. I've submitted a bug report upstream:

Very quickly fixed upstream [1], I'll look at whether this can be applied during compilation of airwave until the fix gets released.