Package Details: ags 3.5.0.24-1

Git Clone URL: https://aur.archlinux.org/ags.git (read-only, click to copy)
Package Base: ags
Description: A development tool that is primarily used to create graphical adventure games
Upstream URL: https://github.com/adventuregamestudio/ags
Keywords: adventure game studio
Licenses: Artistic2.0
Submitter: ainola
Maintainer: ainola
Last Packager: ainola
Votes: 7
Popularity: 0.29
First Submitted: 2015-09-05 23:03
Last Updated: 2020-05-25 17:37

Pinned Comments

ainola commented on 2019-12-15 09:21

I'm no longer interested in maintaining this package. Anyone who is, please speak up!

Latest Comments

« First ‹ Previous 1 2

ainola commented on 2017-11-14 14:39

xyproto: I was having difficulty building despite the newer versions. I'm currently a bit busy, so if you (or anyone else) have had success, please do share.

xyproto commented on 2017-11-14 14:23

Please try with the allegro4 and dumb-a4 packages and see if it works now.

ainola commented on 2017-09-04 13:46

The latest version of dumb has removed allegro support. Unfortunately, this breaks the building of ags. I've raised a bug report here:

https://bugs.archlinux.org/task/55493

ainola commented on 2016-05-25 03:47

Sorry for the delay, I was quite busy this week. :(

I've applied a patch for now until they release a new version. Thanks so much for the help, NeoRaider.

ainola commented on 2016-05-14 03:34

Thanks for the comment, NeoRaider. I've raised a bug report here:

https://github.com/adventuregamestudio/ags/issues/328

NeoRaider commented on 2016-05-13 16:06

This broke due to the update to GCC 6.

The issue is that the ags code has #include directices inside of C++ namespaces. This is just stupid and I'm surprised that it worked with older versions of GCC/libstdc++ ... So unless you want to start patching the code to fix this, it's downgrading GCC until this is fixed in ags upstream.

ainola commented on 2016-05-12 15:07

I've been trying to pinpoint the problem in the little free time I've had this week. It was compiling fine on two machines before I pushed....

Suggestions welcome!

eazar001 commented on 2016-05-10 02:30

I get a slew of errors of the form:
```
/usr/include/c++/6.1.1/cmath:1217:11: error: ‘::trunc’ has not been declared
using ::trunc;
^~~~~
/usr/include/c++/6.1.1/cmath:1218:11: error: ‘::truncf’ has not been declared
using ::truncf;
```

They come from various libraries such as cmath above, and others like csdtlib.
The final result is:
```
Makefile:45: recipe for target '../Plugins/AGSflashlight/agsflashlight.o' failed
make: *** [../Plugins/AGSflashlight/agsflashlight.o] Error 1
make: *** Waiting for unfinished jobs....
make: Leaving directory '/tmp/yaourt-tmp-ebrahim/aur-ags/src/ags-v.3.3.5.5/Engine'
==> ERROR: A failure occurred in build().
Aborting...
==> ERROR: Makepkg was unable to build ags.
```