Package Details: advcp 8.32-4

Git Clone URL: https://aur.archlinux.org/advcp.git (read-only, click to copy)
Package Base: advcp
Description: 'cp' and 'mv' utilities with progress bar patches
Upstream URL: https://www.gnu.org/software/coreutils/
Licenses: GPL3
Provides: acp, advcp, advmv, amv, cpg, mvg
Submitter: Nrm
Maintainer: maximbaz
Last Packager: maximbaz
Votes: 39
Popularity: 1.16
First Submitted: 2012-12-03 16:51
Last Updated: 2020-12-26 16:32

Latest Comments

« First ‹ Previous 1 2 3 4 5 Next › Last »

Nrm commented on 2012-12-16 14:15

I've modified the patch to not have problem with big files (>1Go) original patch uses int instead of long to handle big file size so it doesn't worked. Now I think it's ok tell me if you have any problem

Maxr commented on 2012-12-15 13:31

Working! Thank you very much for the effort to make this work again!

Nrm commented on 2012-12-15 12:02

Ok I've patched the makepkg keep me in touch if the problem still here

MisterAnderson commented on 2012-12-14 06:42

Same here, with aurget and with just makepkg -s

CC lib/argmatch.o
CC lib/argv-iter.o
CC lib/backupfile.o
help2man: can't get '--help' info from man/cp.td/cp
help2man: can't get '--help' info from man/mv.td/mv
make[2]: *** [man/cp.1] Error 127
make[2]: *** Waiting for unfinished jobs....
make[2]: *** [man/mv.1] Error 127
make[2]: Leaving directory `/home/greg/builds/advcp/src/coreutils-8.20'
make[1]: *** [all-recursive] Error 1
make[1]: Leaving directory `/home/greg/builds/advcp/src/coreutils-8.20'
make: *** [all] Error 2
==> ERROR: A failure occurred in build().
Aborting...

Nrm commented on 2012-12-06 17:06

I've tested it on 2 clean host that I've just installed and I'm not able to reproduce the problem. I don't why this is happening, the executable help2man is in the directory coreutils-8.20/man/ directory cp.td doesn't exist, but other directory's doesn't too... are they temp folders ?

Maxr commented on 2012-12-06 10:33

Same here with yaourt and makepkg itself (same error msg).

Nrm commented on 2012-12-04 07:57

that's curioux, I had'nt checked with yaourt and I didn't know help2man, so I installed it and compile it and it works fine
have you tried to install it manually with abs ? (makepkg -s in the tarball)

msx commented on 2012-12-04 04:38

Hi @Nrm, I have these errors at compile time:

[...]
CC lib/set-mode-acl.o
CC lib/copy-acl.o
CC lib/file-has-acl.o
help2man: can't get '--help' info from man/cp.td/cp
make[2]: *** [man/cp.1] Error 127
make[2]: *** Waiting for unfinished jobs....
help2man: can't get '--help' info from man/mv.td/mv
make[2]: *** [man/mv.1] Error 127
make[2]: Leaving directory `/tmp/yaourt-tmp-arrakis/aur-advcp/src/coreutils-8.20'
make[1]: *** [all-recursive] Error 1
make[1]: Leaving directory `/tmp/yaourt-tmp-arrakis/aur-advcp/src/coreutils-8.20'
make: *** [all] Error 2
==> ERROR: A failure occurred in build().
Aborting...
==> ERROR: Makepkg was unable to build advcp.
==> Restart building advcp ? [y/N]
==> ------------------------------
==>

Please note that I have installed help2man.

Nrm commented on 2012-12-03 16:56

I've upgraded the package, and created a less risky one https://aur.archlinux.org/packages/advcp/
It only add acp and amv commands

whoami commented on 2012-11-04 19:49

ooops, not here