Package Details: adguardhome 1:0.106.3-1

Git Clone URL: (read-only, click to copy)
Package Base: adguardhome
Description: Network-wide ads and trackers blocking DNS server
Upstream URL:
Licenses: GPL
Submitter: graysky
Maintainer: graysky
Last Packager: graysky
Votes: 10
Popularity: 0.130078
First Submitted: 2019-12-22 11:00
Last Updated: 2021-05-19 13:47

Latest Comments

« First ‹ Previous 1 2 3 4 5 Next › Last »

mvidaldp commented on 2021-03-18 12:26

@graysky I actually did not manage to build it on aarch64 since the version 0.105.x Before it worked like a charm (until 0.104.x). I just wanted to point out that there is an alternative in case the build does not work for someones else, not blaming you :) Plus, it takes quite a lot of time and storage to build it. So it is definitely convenient to consider the binary package if you want to install it on a raspberry pi, for instance.

graysky commented on 2021-03-16 18:06

This packages builds fine on armv7h, aarch64, and x86_64. If someone is building this package, they want to do so from source. No sure why you're advertising the binary package here.

mvidaldp commented on 2021-03-16 14:35

In case you have problems building it for arm architectures, consider adguardhome's binary AUR package:

graysky commented on 2021-03-07 22:39

Thanks for letting me know.

Pavers_Career commented on 2021-03-07 22:17


Working as expected, thanks.

graysky commented on 2021-03-07 22:08

@setboolean - Please try 0.105.1-2 and report back.

Pavers_Career commented on 2021-03-07 21:58


To the AdGuardHome.service unit.


Upstream Issue:

graysky commented on 2021-03-07 20:28

@setboolean - Added to ...?

Pavers_Career commented on 2021-03-07 14:23

CAP_NET_RAW needs to be added to the capability set for the DHCP Server to work.

Pavers_Career commented on 2021-03-05 02:12

I'm getting the following error during the build process. Can anybody offer some guidance?

==> Starting build()...
npm --prefix client ci
npm ERR! semver.simplifyRange is not a function

npm ERR! A complete log of this run can be found in:
npm ERR!     /home/xxx/.npm/_logs/2021-03-05T02_10_42_102Z-debug.log
make: *** [Makefile:69: js-deps] Error 1
==> ERROR: A failure occurred in build().
error making: adguardhome


Seemed to be problem with npm on my side.


Delete $user/.npm folders. Run npm clean cache --force. Build AdGuardHome as usual.