Package Details: ace-of-penguins 1.4-3

Git Clone URL: https://aur.archlinux.org/ace-of-penguins.git (read-only, click to copy)
Package Base: ace-of-penguins
Description: A set of Unix/X solitaire games.
Upstream URL: http://www.delorie.com/store/ace/
Licenses: GPL
Submitter: renato
Maintainer: stevenhoneyman
Last Packager: stevenhoneyman
Votes: 21
Popularity: 0.000000
First Submitted: 2008-10-20 05:03
Last Updated: 2015-06-09 18:07

Latest Comments

1 2 3 Next › Last »

sng commented on 2020-10-06 23:29

ok, fixed it... I just added this to ace14_fixes.patch

--- ace-1.4/lib/xwin.c  2020-10-07 02:07:59.000000000 +0300
+++ ace14/lib/xwin.c    2020-10-07 02:15:05.941784967 +0300
@@ -55,7 +55,6 @@
   { "-visual", OPTION_INTEGER, &visual_id },
   { 0, 0, 0 }
 };
-OptionDesc *xwin_options = xwin_options_list;

 Display *display=0;
 int screen=0;

sng commented on 2020-10-03 19:10

This is on a fresh install...

/bin/sh ../libtool --tag=CC   --mode=link gcc  -march=x86-64 -mtune=generic -O2 -pipe -fstack-protector-strong --param=ssp-buffer-size=4 -version-info 1:0:0  -Wl,-O1,--sort-common,--as-needed,-z,relro -lpng -lz -lm -o libcards.la -rpath /usr/lib table.lo help.lo stack.lo imagelib.lo xwin.lo images.lo table_rn.lo funcs.lo  
libtool: link: gcc -shared  .libs/table.o .libs/help.o .libs/stack.o .libs/imagelib.o .libs/xwin.o .libs/images.o .libs/table_rn.o .libs/funcs.o   -lpng -lz -lm  -march=x86-64 -mtune=generic -Wl,-O1 -Wl,--sort-common -Wl,--as-needed -Wl,-z -Wl,relro   -Wl,-soname -Wl,libcards.so.1 -o .libs/libcards.so.1.0.0
/usr/bin/ld: .libs/xwin.o:(.data.rel+0x40): multiple definition of `xwin_options'; .libs/table.o:(.bss+0x8): first defined here
collect2: error: ld returned 1 exit status
make[1]: *** [Makefile:303: libcards.la] Error 1
make[1]: Leaving directory '/home/user/.cache/yay/ace-of-penguins/src/ace-1.4/lib'
make: *** [Makefile:281: all-recursive] Error 1
==> ERROR: A failure occurred in build().
    Aborting...
error making: ace-of-penguins

Anyone can help?

stevenhoneyman commented on 2014-05-26 08:36

Adopted and fixed :)

ant commented on 2014-04-17 06:12

It looks like the generated Makefile is broken. Please someone of you report this to upstream.

dennis123123 commented on 2014-04-15 20:51

Running 64 bit arch, I get the same error as idomeneo1

idomeneo1 commented on 2014-01-18 17:18

I am running 32-bit. I can't even MAKE directly from the source, either, so the problem does seem to be upstream, but I can't find on their website anywhere to report bugs.

wchouser3 commented on 2014-01-13 20:05

Hello....I'm getting the same message as idomeneo1. I'm running 64bit arch.

ant commented on 2014-01-07 20:56

Everything works for me, but I am running 64-bit Arch Linux. Are you running 32-bit? As you can see from the PKGBUILD it is a pretty standard kind of build (configure and make). Upstream can probably help you better than me, but you should provide them with more info about your environment.

idomeneo1 commented on 2014-01-06 16:33

Hi, I'm getting an error in makepkg:

collect2: error: ld returned 1 exit status
Makefile:387: recipe for target 'canfield' failed
make[2]: *** [canfield] Error 1
make[2]: Leaving directory '/home/admin/.AUR/ace-of-penguins/src/ace-1.4/games'
Makefile:309: recipe for target 'all' failed
make[1]: *** [all] Error 2
make[1]: Leaving directory '/home/admin/.AUR/ace-of-penguins/src/ace-1.4/games'
Makefile:281: recipe for target 'all-recursive' failed
make: *** [all-recursive] Error 1
==> ERROR: A failure occurred in build().
Aborting...

idomeneo1 commented on 2014-01-06 14:15

collect2: error: ld returned 1 exit status
Makefile:387: recipe for target 'canfield' failed
make[2]: *** [canfield] Error 1
make[2]: Leaving directory '/home/admin/.AUR/ace-of-penguins/src/ace-1.4/games'
Makefile:309: recipe for target 'all' failed
make[1]: *** [all] Error 2
make[1]: Leaving directory '/home/admin/.AUR/ace-of-penguins/src/ace-1.4/games'
Makefile:281: recipe for target 'all-recursive' failed
make: *** [all-recursive] Error 1
==> ERROR: A failure occurred in build().
Aborting...