Package Details: abinit 9.2.1-1

Git Clone URL: (read-only, click to copy)
Package Base: abinit
Description: Full-featured atomic-scale first-principles simulation software.
Upstream URL:
Licenses: GPLv3
Submitter: None
Maintainer: Xyne
Last Packager: Xyne
Votes: 4
Popularity: 0.007662
First Submitted: 2009-12-18 07:23
Last Updated: 2020-10-18 17:54

Latest Comments

« First ‹ Previous 1 2

Anonymous comment on 2013-05-16 14:36

Doesn't compile here :(
also tried to download new version and compile by hand, but same error:

../../src/11_memory_mpi/lib11_memory_mpi.a(m_profiling.o):/home/mh/bulids/abinit-7.2.1/src/11_memory_mpi/m_profiling.F90:133: first defined here
/home/mh/bulids/abinit-7.2.1/fallbacks/exports/lib/libabinit.a(m_profiling.o): In function `__m_profiling_MOD_memocc_set_state':
/home/mh/bulids/abinit-7.2.1/fallbacks/sources/bigdft-abi-1.0.4/libABINIT/src/18_memory/m_profiling.F90:71: multiple definition of `__m_profiling_MOD_memocc_set_state'
../../src/11_memory_mpi/lib11_memory_mpi.a(m_profiling.o):/home/mh/bulids/abinit-7.2.1/src/11_memory_mpi/m_profiling.F90:83: first defined here
collect2: Fehler: ld gab 1 als Ende-Status zurück
make[3]: *** [abinit] Fehler 1
make[3]: Leaving directory `/home/mh/bulids/abinit-7.2.1/src/98_main'
make[2]: *** [all-recursive] Fehler 1
make[2]: Leaving directory `/home/mh/bulids/abinit-7.2.1/src'
make[1]: *** [all-recursive] Fehler 1
make[1]: Leaving directory `/home/mh/bulids/abinit-7.2.1'
make: *** [all] Fehler 2

Xyne commented on 2013-01-31 03:18

Disowned, adopted and updated. The package had been out-of-date for nearly 2 years and the maintainer has not been active for nearly 2.5.

The current package uses the default upstream configuration options, which include about 164 MB of test files. I am not familiar with the software so I do not yet know if these files are useful. They may be moved to a separate package in the future.

hcar commented on 2011-03-01 18:01

new version: